{"text_format":"3","workbook":"xlsx","n_sheets":4,"sheets":["Info","Periodic Table","Sheet2","Data"],"not_rendered":{"macros":1,"defined_names":23,"comments":1},"read":"whole","date_system":"1900"}

{"sheet":"Info","index":0,"n_rows":13,"n_cols":10,"rows_kept":13,"merged":[[2,1,4,11],[6,1,6,11],[8,1,8,11],[10,9,10,11],[12,1,12,11]]}
[]
[]
[null,"       YASİN ENGİN (Civil Engineer, M.Sc.)           "]
[]
[]
[]
[null,"www.betonvecimento.com "]
[]
[null,"yasin.engin@gmail.com"]
[]
[{"$nulls":9},"Ocak 2015, V.1"]
[]
[null,"Just move your mouse on the table to view the properties of the elements."]

{"sheet":"Periodic Table","index":1,"n_rows":39,"n_cols":27,"rows_kept":39,"merged":[[1,21,1,22],[26,22,26,23]]}
[]
[{"$nulls":21},"Filter Selection"]
[{"$nulls":20},1,"<",{"$f":"IFERROR(HYPERLINK(ToggleFilter(U3),AA18),AA18)","v":"ALKALI METALS"},{"$f":"OR(U3=ToggleIndex,Y3)","v":false},false]
[null,null,{"$f":"C18 &CHAR(10) &INDEX(Symbol,IFERROR(HYPERLINK(RolloverElement(C18),C18+1),C18+1))","v":"1\nH"},{"$nulls":16},{"$f":"T18 &CHAR(10) &INDEX(Symbol,IFERROR(HYPERLINK(RolloverElement(T18),T18+1),T18+1))","v":"2\nHe"},2,"<",{"$f":"IFERROR(HYPERLINK(ToggleFilter(U4),AA19),AA19)","v":"ALKALINE EARTH METALS"},false,false]
[null,null,{"$f":"C19 &CHAR(10) &INDEX(Symbol,IFERROR(HYPERLINK(RolloverElement(C19),C19+1),C19+1))","v":"3\nLi"},{"$f":"D19 &CHAR(10) &INDEX(Symbol,IFERROR(HYPERLINK(RolloverElement(D19),D19+1),D19+1))","v":"4\nBe"},{"$nulls":10},{"$f":"O19 &CHAR(10) &INDEX(Symbol,IFERROR(HYPERLINK(RolloverElement(O19),O19+1),O19+1))","v":"5\nB"},{"$f":"P19 &CHAR(10) &INDEX(Symbol,IFERROR(HYPERLINK(RolloverElement(P19),P19+1),P19+1))","v":"6\nC"},{"$f":"Q19 &CHAR(10) &INDEX(Symbol,IFERROR(HYPERLINK(RolloverElement(Q19),Q19+1),Q19+1))","v":"7\nN"},{"$f":"R19 &CHAR(10) &INDEX(Symbol,IFERROR(HYPERLINK(RolloverElement(R19),R19+1),R19+1))","v":"8\nO"},{"$f":"S19 &CHAR(10) &INDEX(Symbol,IFERROR(HYPERLINK(RolloverElement(S19),S19+1),S19+1))","v":"9\nF"},{"$f":"T19 &CHAR(10) &INDEX(Symbol,IFERROR(HYPERLINK(RolloverElement(T19),T19+1),T19+1))","v":"10\nNe"},3,"<",{"$f":"IFERROR(HYPERLINK(ToggleFilter(U5),AA20),AA20)","v":"LANTHANIDES"},false,false]
[null,null,{"$f":"C20 &CHAR(10) &INDEX(Symbol,IFERROR(HYPERLINK(RolloverElement(C20),C20+1),C20+1))","v":"11\nNa"},{"$f":"D20 &CHAR(10) &INDEX(Symbol,IFERROR(HYPERLINK(RolloverElement(D20),D20+1),D20+1))","v":"12\nMg"},{"$nulls":10},{"$f":"O20 &CHAR(10) &INDEX(Symbol,IFERROR(HYPERLINK(RolloverElement(O20),O20+1),O20+1))","v":"13\nAl"},{"$f":"P20 &CHAR(10) &INDEX(Symbol,IFERROR(HYPERLINK(RolloverElement(P20),P20+1),P20+1))","v":"14\nSi"},{"$f":"Q20 &CHAR(10) &INDEX(Symbol,IFERROR(HYPERLINK(RolloverElement(Q20),Q20+1),Q20+1))","v":"15\nP"},{"$f":"R20 &CHAR(10) &INDEX(Symbol,IFERROR(HYPERLINK(RolloverElement(R20),R20+1),R20+1))","v":"16\nS"},{"$f":"S20 &CHAR(10) &INDEX(Symbol,IFERROR(HYPERLINK(RolloverElement(S20),S20+1),S20+1))","v":"17\nCl"},{"$f":"T20 &CHAR(10) &INDEX(Symbol,IFERROR(HYPERLINK(RolloverElement(T20),T20+1),T20+1))","v":"18\nAr"},4,"<",{"$f":"IFERROR(HYPERLINK(ToggleFilter(U6),AA21),AA21)","v":"ACTINIDES"},false,false]
[null,null,{"$f":"C21 &CHAR(10) &INDEX(Symbol,IFERROR(HYPERLINK(RolloverElement(C21),C21+1),C21+1))","v":"19\nK"},{"$f":"D21 &CHAR(10) &INDEX(Symbol,IFERROR(HYPERLINK(RolloverElement(D21),D21+1),D21+1))","v":"20\nCa"},{"$f":"E21 &CHAR(10) &INDEX(Symbol,IFERROR(HYPERLINK(RolloverElement(E21),E21+1),E21+1))","v":"21\nSc"},{"$f":"F21 &CHAR(10) &INDEX(Symbol,IFERROR(HYPERLINK(RolloverElement(F21),F21+1),F21+1))","v":"22\nTi"},{"$f":"G21 &CHAR(10) &INDEX(Symbol,IFERROR(HYPERLINK(RolloverElement(G21),G21+1),G21+1))","v":"23\nV"},{"$f":"H21 &CHAR(10) &INDEX(Symbol,IFERROR(HYPERLINK(RolloverElement(H21),H21+1),H21+1))","v":"24\nCr"},{"$f":"I21 &CHAR(10) &INDEX(Symbol,IFERROR(HYPERLINK(RolloverElement(I21),I21+1),I21+1))","v":"25\nMn"},{"$f":"J21 &CHAR(10) &INDEX(Symbol,IFERROR(HYPERLINK(RolloverElement(J21),J21+1),J21+1))","v":"26\nFe"},{"$f":"K21 &CHAR(10) &INDEX(Symbol,IFERROR(HYPERLINK(RolloverElement(K21),K21+1),K21+1))","v":"27\nCo"},{"$f":"L21 &CHAR(10) &INDEX(Symbol,IFERROR(HYPERLINK(RolloverElement(L21),L21+1),L21+1))","v":"28\nNi"},{"$f":"M21 &CHAR(10) &INDEX(Symbol,IFERROR(HYPERLINK(RolloverElement(M21),M21+1),M21+1))","v":"29\nCu"},{"$f":"N21 &CHAR(10) &INDEX(Symbol,IFERROR(HYPERLINK(RolloverElement(N21),N21+1),N21+1))","v":"30\nZn"},{"$f":"O21 &CHAR(10) &INDEX(Symbol,IFERROR(HYPERLINK(RolloverElement(O21),O21+1),O21+1))","v":"31\nGa"},{"$f":"P21 &CHAR(10) &INDEX(Symbol,IFERROR(HYPERLINK(RolloverElement(P21),P21+1),P21+1))","v":"32\nGe"},{"$f":"Q21 &CHAR(10) &INDEX(Symbol,IFERROR(HYPERLINK(RolloverElement(Q21),Q21+1),Q21+1))","v":"33\nAs"},{"$f":"R21 &CHAR(10) &INDEX(Symbol,IFERROR(HYPERLINK(RolloverElement(R21),R21+1),R21+1))","v":"34\nSe"},{"$f":"S21 &CHAR(10) &INDEX(Symbol,IFERROR(HYPERLINK(RolloverElement(S21),S21+1),S21+1))","v":"35\nBr"},{"$f":"T21 &CHAR(10) &INDEX(Symbol,IFERROR(HYPERLINK(RolloverElement(T21),T21+1),T21+1))","v":"36\nKr"},5,"<",{"$f":"IFERROR(HYPERLINK(ToggleFilter(U7),AA22),AA22)","v":"TRANSITION METALS"},false,false]
[null,null,{"$f":"C22 &CHAR(10) &INDEX(Symbol,IFERROR(HYPERLINK(RolloverElement(C22),C22+1),C22+1))","v":"37\nRb"},{"$f":"D22 &CHAR(10) &INDEX(Symbol,IFERROR(HYPERLINK(RolloverElement(D22),D22+1),D22+1))","v":"38\nSr"},{"$f":"E22 &CHAR(10) &INDEX(Symbol,IFERROR(HYPERLINK(RolloverElement(E22),E22+1),E22+1))","v":"39\nY"},{"$f":"F22 &CHAR(10) &INDEX(Symbol,IFERROR(HYPERLINK(RolloverElement(F22),F22+1),F22+1))","v":"40\nZr"},{"$f":"G22 &CHAR(10) &INDEX(Symbol,IFERROR(HYPERLINK(RolloverElement(G22),G22+1),G22+1))","v":"41\nNb"},{"$f":"H22 &CHAR(10) &INDEX(Symbol,IFERROR(HYPERLINK(RolloverElement(H22),H22+1),H22+1))","v":"42\nMo"},{"$f":"I22 &CHAR(10) &INDEX(Symbol,IFERROR(HYPERLINK(RolloverElement(I22),I22+1),I22+1))","v":"43\nTc"},{"$f":"J22 &CHAR(10) &INDEX(Symbol,IFERROR(HYPERLINK(RolloverElement(J22),J22+1),J22+1))","v":"44\nRu"},{"$f":"K22 &CHAR(10) &INDEX(Symbol,IFERROR(HYPERLINK(RolloverElement(K22),K22+1),K22+1))","v":"45\nRh"},{"$f":"L22 &CHAR(10) &INDEX(Symbol,IFERROR(HYPERLINK(RolloverElement(L22),L22+1),L22+1))","v":"46\nPd"},{"$f":"M22 &CHAR(10) &INDEX(Symbol,IFERROR(HYPERLINK(RolloverElement(M22),M22+1),M22+1))","v":"47\nAg"},{"$f":"N22 &CHAR(10) &INDEX(Symbol,IFERROR(HYPERLINK(RolloverElement(N22),N22+1),N22+1))","v":"48\nCd"},{"$f":"O22 &CHAR(10) &INDEX(Symbol,IFERROR(HYPERLINK(RolloverElement(O22),O22+1),O22+1))","v":"49\nIn"},{"$f":"P22 &CHAR(10) &INDEX(Symbol,IFERROR(HYPERLINK(RolloverElement(P22),P22+1),P22+1))","v":"50\nSn"},{"$f":"Q22 &CHAR(10) &INDEX(Symbol,IFERROR(HYPERLINK(RolloverElement(Q22),Q22+1),Q22+1))","v":"51\nSb"},{"$f":"R22 &CHAR(10) &INDEX(Symbol,IFERROR(HYPERLINK(RolloverElement(R22),R22+1),R22+1))","v":"52\nTe"},{"$f":"S22 &CHAR(10) &INDEX(Symbol,IFERROR(HYPERLINK(RolloverElement(S22),S22+1),S22+1))","v":"53\nI"},{"$f":"T22 &CHAR(10) &INDEX(Symbol,IFERROR(HYPERLINK(RolloverElement(T22),T22+1),T22+1))","v":"54\nXe"},6,"<",{"$f":"IFERROR(HYPERLINK(ToggleFilter(U8),AA23),AA23)","v":"POST-TRANSITION METALS"},false,false]
[null,null,{"$f":"C23 &CHAR(10) &INDEX(Symbol,IFERROR(HYPERLINK(RolloverElement(C23),C23+1),C23+1))","v":"55\nCs"},{"$f":"D23 &CHAR(10) &INDEX(Symbol,IFERROR(HYPERLINK(RolloverElement(D23),D23+1),D23+1))","v":"56\nBa"},"…",{"$f":"F23 &CHAR(10) &INDEX(Symbol,IFERROR(HYPERLINK(RolloverElement(F23),F23+1),F23+1))","v":"72\nHf"},{"$f":"G23 &CHAR(10) &INDEX(Symbol,IFERROR(HYPERLINK(RolloverElement(G23),G23+1),G23+1))","v":"73\nTa"},{"$f":"H23 &CHAR(10) &INDEX(Symbol,IFERROR(HYPERLINK(RolloverElement(H23),H23+1),H23+1))","v":"74\nW"},{"$f":"I23 &CHAR(10) &INDEX(Symbol,IFERROR(HYPERLINK(RolloverElement(I23),I23+1),I23+1))","v":"75\nRe"},{"$f":"J23 &CHAR(10) &INDEX(Symbol,IFERROR(HYPERLINK(RolloverElement(J23),J23+1),J23+1))","v":"76\nOs"},{"$f":"K23 &CHAR(10) &INDEX(Symbol,IFERROR(HYPERLINK(RolloverElement(K23),K23+1),K23+1))","v":"77\nIr"},{"$f":"L23 &CHAR(10) &INDEX(Symbol,IFERROR(HYPERLINK(RolloverElement(L23),L23+1),L23+1))","v":"78\nPt"},{"$f":"M23 &CHAR(10) &INDEX(Symbol,IFERROR(HYPERLINK(RolloverElement(M23),M23+1),M23+1))","v":"79\nAu"},{"$f":"N23 &CHAR(10) &INDEX(Symbol,IFERROR(HYPERLINK(RolloverElement(N23),N23+1),N23+1))","v":"80\nHg"},{"$f":"O23 &CHAR(10) &INDEX(Symbol,IFERROR(HYPERLINK(RolloverElement(O23),O23+1),O23+1))","v":"81\nTl"},{"$f":"P23 &CHAR(10) &INDEX(Symbol,IFERROR(HYPERLINK(RolloverElement(P23),P23+1),P23+1))","v":"82\nPb"},{"$f":"Q23 &CHAR(10) &INDEX(Symbol,IFERROR(HYPERLINK(RolloverElement(Q23),Q23+1),Q23+1))","v":"83\nBi"},{"$f":"R23 &CHAR(10) &INDEX(Symbol,IFERROR(HYPERLINK(RolloverElement(R23),R23+1),R23+1))","v":"84\nPo"},{"$f":"S23 &CHAR(10) &INDEX(Symbol,IFERROR(HYPERLINK(RolloverElement(S23),S23+1),S23+1))","v":"85\nAt"},{"$f":"T23 &CHAR(10) &INDEX(Symbol,IFERROR(HYPERLINK(RolloverElement(T23),T23+1),T23+1))","v":"86\nRn"},7,"<",{"$f":"IFERROR(HYPERLINK(ToggleFilter(U9),AA24),AA24)","v":"METALlOIDS"},false,false]
[null,null,{"$f":"C24 &CHAR(10) &INDEX(Symbol,IFERROR(HYPERLINK(RolloverElement(C24),C24+1),C24+1))","v":"87\nFr"},{"$f":"D24 &CHAR(10) &INDEX(Symbol,IFERROR(HYPERLINK(RolloverElement(D24),D24+1),D24+1))","v":"88\nRa"},"…",{"$f":"F24 &CHAR(10) &INDEX(Symbol,IFERROR(HYPERLINK(RolloverElement(F24),F24+1),F24+1))","v":"104\nRf"},{"$f":"G24 &CHAR(10) &INDEX(Symbol,IFERROR(HYPERLINK(RolloverElement(G24),G24+1),G24+1))","v":"105\nDb"},{"$f":"H24 &CHAR(10) &INDEX(Symbol,IFERROR(HYPERLINK(RolloverElement(H24),H24+1),H24+1))","v":"106\nSg"},{"$f":"I24 &CHAR(10) &INDEX(Symbol,IFERROR(HYPERLINK(RolloverElement(I24),I24+1),I24+1))","v":"107\nBh"},{"$f":"J24 &CHAR(10) &INDEX(Symbol,IFERROR(HYPERLINK(RolloverElement(J24),J24+1),J24+1))","v":"108\nHs"},{"$f":"K24 &CHAR(10) &INDEX(Symbol,IFERROR(HYPERLINK(RolloverElement(K24),K24+1),K24+1))","v":"109\nMt"},{"$f":"L24 &CHAR(10) &INDEX(Symbol,IFERROR(HYPERLINK(RolloverElement(L24),L24+1),L24+1))","v":"110\nDs"},{"$f":"M24 &CHAR(10) &INDEX(Symbol,IFERROR(HYPERLINK(RolloverElement(M24),M24+1),M24+1))","v":"111\nRg"},{"$f":"N24 &CHAR(10) &INDEX(Symbol,IFERROR(HYPERLINK(RolloverElement(N24),N24+1),N24+1))","v":"112\nCn"},{"$f":"O24 &CHAR(10) &INDEX(Symbol,IFERROR(HYPERLINK(RolloverElement(O24),O24+1),O24+1))","v":"113\nUut"},{"$f":"P24 &CHAR(10) &INDEX(Symbol,IFERROR(HYPERLINK(RolloverElement(P24),P24+1),P24+1))","v":"114\nFl"},{"$f":"Q24 &CHAR(10) &INDEX(Symbol,IFERROR(HYPERLINK(RolloverElement(Q24),Q24+1),Q24+1))","v":"115\nUup"},{"$f":"R24 &CHAR(10) &INDEX(Symbol,IFERROR(HYPERLINK(RolloverElement(R24),R24+1),R24+1))","v":"116\nLv"},{"$f":"S24 &CHAR(10) &INDEX(Symbol,IFERROR(HYPERLINK(RolloverElement(S24),S24+1),S24+1))","v":"117\nUus"},{"$f":"T24 &CHAR(10) &INDEX(Symbol,IFERROR(HYPERLINK(RolloverElement(T24),T24+1),T24+1))","v":"118\nUuo"},8,"<",{"$f":"IFERROR(HYPERLINK(ToggleFilter(U10),AA25),AA25)","v":"NONMETALS"},false,false]
[{"$nulls":20},9,"<",{"$f":"IFERROR(HYPERLINK(ToggleFilter(U11),AA26),AA26)","v":"HALOGENS"},false,false]
[{"$nulls":4},{"$f":"E26 &CHAR(10) &INDEX(Symbol,IFERROR(HYPERLINK(RolloverElement(E26),E26+1),E26+1))","v":"57\nLa"},{"$f":"F26 &CHAR(10) &INDEX(Symbol,IFERROR(HYPERLINK(RolloverElement(F26),F26+1),F26+1))","v":"58\nCe"},{"$f":"G26 &CHAR(10) &INDEX(Symbol,IFERROR(HYPERLINK(RolloverElement(G26),G26+1),G26+1))","v":"59\nPr"},{"$f":"H26 &CHAR(10) &INDEX(Symbol,IFERROR(HYPERLINK(RolloverElement(H26),H26+1),H26+1))","v":"60\nNd"},{"$f":"I26 &CHAR(10) &INDEX(Symbol,IFERROR(HYPERLINK(RolloverElement(I26),I26+1),I26+1))","v":"61\nPm"},{"$f":"J26 &CHAR(10) &INDEX(Symbol,IFERROR(HYPERLINK(RolloverElement(J26),J26+1),J26+1))","v":"62\nSm"},{"$f":"K26 &CHAR(10) &INDEX(Symbol,IFERROR(HYPERLINK(RolloverElement(K26),K26+1),K26+1))","v":"63\nEu"},{"$f":"L26 &CHAR(10) &INDEX(Symbol,IFERROR(HYPERLINK(RolloverElement(L26),L26+1),L26+1))","v":"64\nGd"},{"$f":"M26 &CHAR(10) &INDEX(Symbol,IFERROR(HYPERLINK(RolloverElement(M26),M26+1),M26+1))","v":"65\nTb"},{"$f":"N26 &CHAR(10) &INDEX(Symbol,IFERROR(HYPERLINK(RolloverElement(N26),N26+1),N26+1))","v":"66\nDy"},{"$f":"O26 &CHAR(10) &INDEX(Symbol,IFERROR(HYPERLINK(RolloverElement(O26),O26+1),O26+1))","v":"67\nHo"},{"$f":"P26 &CHAR(10) &INDEX(Symbol,IFERROR(HYPERLINK(RolloverElement(P26),P26+1),P26+1))","v":"68\nEr"},{"$f":"Q26 &CHAR(10) &INDEX(Symbol,IFERROR(HYPERLINK(RolloverElement(Q26),Q26+1),Q26+1))","v":"69\nTm"},{"$f":"R26 &CHAR(10) &INDEX(Symbol,IFERROR(HYPERLINK(RolloverElement(R26),R26+1),R26+1))","v":"70\nYb"},{"$f":"S26 &CHAR(10) &INDEX(Symbol,IFERROR(HYPERLINK(RolloverElement(S26),S26+1),S26+1))","v":"71\nLu"},null,10,"<",{"$f":"IFERROR(HYPERLINK(ToggleFilter(U12),AA27),AA27)","v":"NOBLE GASES"},false,false]
[{"$nulls":4},{"$f":"E27 &CHAR(10) &INDEX(Symbol,IFERROR(HYPERLINK(RolloverElement(E27),E27+1),E27+1))","v":"89\nAc"},{"$f":"F27 &CHAR(10) &INDEX(Symbol,IFERROR(HYPERLINK(RolloverElement(F27),F27+1),F27+1))","v":"90\nTh"},{"$f":"G27 &CHAR(10) &INDEX(Symbol,IFERROR(HYPERLINK(RolloverElement(G27),G27+1),G27+1))","v":"91\nPa"},{"$f":"H27 &CHAR(10) &INDEX(Symbol,IFERROR(HYPERLINK(RolloverElement(H27),H27+1),H27+1))","v":"92\nU"},{"$f":"I27 &CHAR(10) &INDEX(Symbol,IFERROR(HYPERLINK(RolloverElement(I27),I27+1),I27+1))","v":"93\nNp"},{"$f":"J27 &CHAR(10) &INDEX(Symbol,IFERROR(HYPERLINK(RolloverElement(J27),J27+1),J27+1))","v":"94\nPu"},{"$f":"K27 &CHAR(10) &INDEX(Symbol,IFERROR(HYPERLINK(RolloverElement(K27),K27+1),K27+1))","v":"95\nAm"},{"$f":"L27 &CHAR(10) &INDEX(Symbol,IFERROR(HYPERLINK(RolloverElement(L27),L27+1),L27+1))","v":"96\nCm"},{"$f":"M27 &CHAR(10) &INDEX(Symbol,IFERROR(HYPERLINK(RolloverElement(M27),M27+1),M27+1))","v":"97\nBk"},{"$f":"N27 &CHAR(10) &INDEX(Symbol,IFERROR(HYPERLINK(RolloverElement(N27),N27+1),N27+1))","v":"98\nCf"},{"$f":"O27 &CHAR(10) &INDEX(Symbol,IFERROR(HYPERLINK(RolloverElement(O27),O27+1),O27+1))","v":"99\nEs"},{"$f":"P27 &CHAR(10) &INDEX(Symbol,IFERROR(HYPERLINK(RolloverElement(P27),P27+1),P27+1))","v":"100\nFm"},{"$f":"Q27 &CHAR(10) &INDEX(Symbol,IFERROR(HYPERLINK(RolloverElement(Q27),Q27+1),Q27+1))","v":"101\nMd"},{"$f":"R27 &CHAR(10) &INDEX(Symbol,IFERROR(HYPERLINK(RolloverElement(R27),R27+1),R27+1))","v":"102\nNo"},{"$f":"S27 &CHAR(10) &INDEX(Symbol,IFERROR(HYPERLINK(RolloverElement(S27),S27+1),S27+1))","v":"103\nLr"},null,11,"<",{"$f":"IFERROR(HYPERLINK(ToggleFilter(U13),AA28),AA28)","v":"UNKNOWN"},false,false]
[]
[]
[null,"Group"]
[null,"Period",1,2,3,4,5,6,7,8,9,10,11,12,13,14,15,16,17,18,null,null,"ToggleIndex",0]
[null,1,{"$f":"SUMPRODUCT((Group=C$17)*(Period=$B18)*(Znumber))","v":1},0,0,0,0,0,0,0,0,0,{"$f":"SUMPRODUCT((Group=M$17)*(Period=$B18)*(Znumber))","v":0},0,0,0,0,0,0,2,null,null,"zIndex",91,null,null,"ALKALI METALS"]
[null,2,3,4,0,0,0,0,0,0,0,0,0,0,5,6,7,8,9,10,null,null,"Element",{"$f":"INDEX(ElementName,zIndex)","v":"Thorium"},null,null,"ALKALINE EARTH METALS"]
[null,3,11,12,0,0,0,0,0,0,0,0,0,0,13,14,15,16,17,18,null,null,"Weight",{"$f":"LEFT(INDEX(Weights,zIndex),5)","v":"232.0"},null,null,"LANTHANIDES"]
[null,4,19,20,21,22,23,24,25,26,27,28,29,30,31,32,33,34,35,36,null,null,"Density",{"$f":"INDEX(Densities,zIndex)","v":11.72},null,null,"ACTINIDES"]
[null,5,37,38,39,40,41,42,43,44,45,46,47,48,49,50,51,52,53,54,null,null,"Melt",{"$f":"INDEX(Melts,zIndex)","v":2028.15},null,null,"TRANSITION METALS"]
[null,6,55,56,71,72,73,74,75,76,77,78,79,80,81,82,83,84,85,86,null,null,"Boil",{"$f":"INDEX(Boils,zIndex)","v":5061},null,null,"POST-TRANSITION METALS"]
[null,7,87,88,103,104,105,106,107,108,109,110,111,112,113,114,115,116,117,118,null,null,"Heat",{"$f":"INDEX(Heats,zIndex)","v":0.113},null,null,"METALlOIDS"]
[{"$nulls":22},"Symbol",{"$f":"INDEX(Symbol,zIndex)","v":"Th"},null,null,"NONMETALS"]
[{"$nulls":4},57,58,59,60,61,62,63,64,65,66,67,68,69,70,71,{"$nulls":3},"zAdjusted",{"$f":"zIndex-1","v":90},null,null,"HALOGENS"]
[{"$nulls":4},89,90,91,92,93,94,95,96,97,98,99,100,101,102,103,{"$nulls":7},"NOBLE GASES"]
[{"$nulls":26},"UNKNOWN"]
[null,"Period",1,2,3,4,5,6,7,8,9,10,11,12,13,14,15,16,17,18]
[null,1,{"$f":"SUMPRODUCT((Group=C$17)*(Period=$B30)*(ClassNo)) *INDEX($X$3:$X$13,SUMPRODUCT((Group=C$17)*(Period=$B30)*(ClassNo)))","v":0},{"$nulls":16},{"$f":"SUMPRODUCT((Group=T$17)*(Period=$B30)*(ClassNo)) *INDEX($X$3:$X$13,SUMPRODUCT((Group=T$17)*(Period=$B30)*(ClassNo)))","v":0}]
[null,2,0,{"$f":"SUMPRODUCT((Group=D$17)*(Period=$B31)*(ClassNo)) *INDEX($X$3:$X$13,SUMPRODUCT((Group=D$17)*(Period=$B31)*(ClassNo)))","v":0},{"$nulls":10},{"$f":"SUMPRODUCT((Group=O$17)*(Period=$B31)*(ClassNo)) *INDEX($X$3:$X$13,SUMPRODUCT((Group=O$17)*(Period=$B31)*(ClassNo)))","v":0},0,0,0,0,0]
[null,3,0,0,{"$nulls":10},0,0,0,0,0,0]
[null,4,0,0,{"$f":"SUMPRODUCT((Group=E$17)*(Period=$B33)*(ClassNo)) *INDEX($X$3:$X$13,SUMPRODUCT((Group=E$17)*(Period=$B33)*(ClassNo)))","v":0},0,0,0,0,0,0,0,0,0,0,0,0,0,0,0]
[null,5,0,0,0,0,0,0,0,0,0,0,0,0,0,0,0,0,0,0]
[null,6,0,0,null,{"$f":"SUMPRODUCT((Group=F$17)*(Period=$B35)*(ClassNo)) *INDEX($X$3:$X$13,SUMPRODUCT((Group=F$17)*(Period=$B35)*(ClassNo)))","v":0},0,0,0,0,0,0,0,0,0,0,0,0,0,0]
[null,7,0,0,null,0,0,0,0,0,0,0,0,0,0,0,0,0,0,0]
[]
[{"$nulls":4},{"$f":"INDEX(ClassNo,E26+1)*INDEX($X$3:$X$13,INDEX(ClassNo,E26+1))","v":0},0,0,0,0,0,0,0,0,0,0,0,0,0,0]
[{"$nulls":4},{"$f":"INDEX(ClassNo,E27+1)*INDEX($X$3:$X$13,INDEX(ClassNo,E27+1))","v":0},0,0,0,0,0,0,0,0,0,0,0,0,0,0]

{"sheet":"Sheet2","index":2,"n_rows":130,"n_cols":73,"rows_kept":130,"hidden":true,"merged":[[1,0,1,11],[2,0,4,0],[2,1,4,1],[2,2,4,2],[2,3,4,3],[2,4,4,4],[2,5,4,5],[2,6,4,6],[2,7,4,7],[2,8,4,8],[2,9,4,9],[2,10,4,10],[2,11,4,11],[2,12,4,12],[2,13,4,13],[2,14,4,14],[2,15,4,15],[2,16,4,16],[2,17,4,17],[2,18,4,18],[2,19,4,19],[2,20,4,20],[2,21,4,21],[2,22,4,22],[2,23,4,23],[2,24,4,24],[2,25,4,25],[2,26,4,26],[2,27,4,27],[2,28,4,28],[2,29,4,29],[2,30,4,30],[2,31,4,31],[2,32,4,32],[2,33,4,33],[2,34,4,34],[2,35,4,35],[2,36,4,36],[2,37,4,37],[2,38,4,38],[2,39,4,39],[2,40,4,40],[2,41,4,41],[2,42,4,42],[2,43,4,43],[2,44,4,44],[2,45,4,45],[2,46,4,46],[2,47,4,47],[2,48,4,48],[2,49,4,49],[2,50,4,50],[2,51,4,51],[2,52,4,52],[2,53,4,53],[2,54,4,54],[2,55,4,55],[2,56,4,56],[2,57,4,57],[2,58,4,58],[2,59,4,59],[2,60,4,60],[2,61,4,61],[2,62,4,62],[2,63,4,63],[2,64,4,64],[2,65,4,65],[2,66,4,66],[2,67,4,67],[2,68,4,68],[2,69,4,69],[2,70,4,70],[2,71,4,71],[2,72,4,72]]}
["Element Data",null,null,"He"]
["These columns are the actual data for each element.  Add new fields or edit values here.  The \"Included Fields\" worksheet should contain references to actual data in this spreadsheet."]
["atomic #","atomic symbol","Group #","Old Group #","Period","English \nelement name","German \nelement name","French \nelement name","Spanish \nelement name","Italian \nelement name","atomic mass (rounded)","atomic mass (IUPAC 2005)","Melting Point, °C","Boiling Point, °C","State at Room Temp.","density g/mL","electronegativity (Pauling)","1st ionization potential (eV) ","2nd ionization potential (eV) ","3rd ionization potential (eV) ","1st ionization potential (kJ/mol) ","2nd ionization potential (kJ/mol) ","3rd ionization potential (kJ/mol) ","Electron Affinity (eV)","Electron Affinity (kJ/mol)","common oxidation states","ions commonly formed","Predicted Electron Configuration","Observed Electron Configuration","atomic radius (Å) ","ionic radius (Å) ","covalent radius (Å) ","radius\n(2- ion)\n(pm)","radius\n(1- ion)\n(pm)","atomic radius\n(pm)","radius\n(1+ ion)\n(pm)","radius\n(2+ ion)\n(pm)","radius\n(3+ ion)\n(pm)","atomic volume (cm^3/mol) ","crystal structure","CAS Registry No.","electrical conductivity (mho/cm) ","specific heat (J/g K) ","heat of fusion (kJ/mol) ","heat of vaporization (kJ/mol) ","thermal conductivity (W/(m K)) ","mg/kg in Earth's crust","mg/L in seawater","% human body mass","Notes","source","color","characteristics","structure","hardness\n(mohs)","uses","reaction with air","reaction with water","reaction with 6M HCl","reaction with 15M HNO3","reaction with 6M NaOH","hydride(s)","oxide(s)","chloride(s)","polarizability\n(A^3)","heat atomization\n(kJ/mol)","year discovered","rel. abund. solar system\n(log)","abundance earth's crust\n(log)","cost, pure\n($/100g)","cost, bulk\n($/100g)","toxic?","carcinogenic?"]
[]
[{"$nulls":28},"Observed Electron Configuration"]
[1,"H",1,"I A",1,"hydrogen","Wasserstoff","hydrogène","hidrógeno","idrogeno",{"$f":"TEXT(ROUND(L6,3),\"0.000\")","v":"0.001"},1.00794,-259.1,-252.9,"gaseous",6.99e-05,2.2,13.5984," ",null,{"$f":"IF(COUNT(R6)=1,ROUND(R6*96.48538,0),\"\")","v":1312},{"$f":"IF(COUNT(S6)=1,ROUND(S6*96.48538,0),\"\")","v":""},"",0.75,{"$f":"IF(COUNT(X6)=1,ROUND(X6*96.48538,0),IF(COUNTA(X6)=1,X6,\"\"))","v":72},"±1","±1",{"$f":"CONCATENATE(E6,\"s\",MIN(A6,2))","v":"1s1"},{"$f":"AB6","v":"1s1"},0.79,1.54,0.32,null,null,37.1,{"$nulls":3},14.4,"hexagonal","1333-74-0","",14.304,0.05868,0.44936,0.1815,1400,108000,10,null,"Water, methane","colorless","diatomic,dens<air at r.t.","hcp: hexagonal close pkd",null,"rocket fuel","vigorous, =>H2O","none","none","none","none","H2","H2O","HCl",0.7,218,1766,{"v":10.445604203273597,"d":"10.446"},3.1,12]
[2,"He",18,"VIII A",1,"helium","Helium","hélium","helio","elio",{"$f":"TEXT(ROUND(L7,3),\"0.000\")","v":"0.004"},4.002602,-272.2,-268.9,"gaseous",0.000179,null,24.5874,54.416,null,{"$f":"IF(COUNT(R7)=1,ROUND(R7*96.48538,0),\"\")","v":2372},5250,"","<0",{"$f":"IF(COUNT(X7)=1,ROUND(X7*96.48538,0),IF(COUNTA(X7)=1,X7,\"\"))","v":"<0"},"0",null,{"$f":"CONCATENATE(E7,\"s\",MIN(A7,2))","v":"1s2"},{"$f":"AB7","v":"1s2"},0.49,"",0.93,null,null,31,{"$nulls":3},19.5,"hexagonal","7440-59-7","",5.193,"",0.0845,0.152,0.008,7e-16,null,null,"Natural gas, air","colorless","Inert, dens<air at r.t.",null,null,"cryogenics, blimps","none","none","none","none","none","none","none","none",0.198,0,1895,{"v":9.434568904034197,"d":"9.435"},-2.1,5.2,null,"no","no"]
[3,"Li",1,"I A",2,"lithium","Lithium","lithium","litio","litio",{"$f":"TEXT(ROUND(L8,3),\"0.000\")","v":"0.007"},6.941,180.5,1342,"solid",0.543,0.98,5.3917,76.638,122.451,520,7394,11815,0.62,60,"+1","+1",{"$f":"CONCATENATE(\"[\",B$7,\"] \",E8,\"s\",MIN(A8-A$7,2))","v":"[He] 2s1"},"[He] 2s1",2.05,0.76,1.23,null,null,152,90,null,null,13.1,"cubic: body centered","7439-93-2",0.108,3.6,3,145.92,84.7,20,0.18,null,null,"Spodumene (silicate)","silvery","soft, lightest solid","bcc: body-centered cubic",0.6,"batteries, lubricant","vigorous, =>Li2O","mild, =>H2, LiOH","vigorous, =>H2, LiCl","vigorous, =>LiNO3","mild, =>H2, LiOH","LiH","Li2O","LiCl",24.3,161,1817,{"v":1.756636108245848,"d":"1.757"},1.3,27]
[4,"Be",2,"II A",2,"beryllium","Beryllium","béryllium","berilio","berillio",{"$f":"TEXT(ROUND(L9,3),\"0.000\")","v":"0.009"},9.012182,1278,2970,"solid",1.85,1.57,9.3226,18.211,153.893,899,1757,14848,"<0","<0","+2","+2",{"$f":"CONCATENATE(\"[\",B$7,\"] \",E9,\"s\",MIN(A9-A$7,2))","v":"[He] 2s2"},"[He] 2s2",1.4,0.45,0.9,null,null,112,null,59,null,5,"hexagonal","7440-41-7",0.313,1.82,12.2,292.4,200,2.8,5.6e-06,null,null,"Beryl (silicate)","steel gray","toxic","hcp: hexagonal close pkd",null,"Cu alloys, X-ray windows","vigorous, w/ht=>BeO,Be3N2","none","mild, =>H2","none","mild, =>H2, [Be(OH)4](2-)","BeH2","BeO","BeCl2",5.6,324,1797,{"v":-0.13667713987954408,"d":"-0.137"},0.4,530,59,"yes","yes"]
[5,"B",13,"III A",2,"boron","Bor","bore","boro","boro",{"$f":"TEXT(ROUND(L10,2),\"0.00\")","v":"011"},10.811,2079,2550,"solid",2.34,2.04,8.298,25.154,37.93,801,2427,3660,0.28,27,"+3","+3",{"$f":"CONCATENATE(AB$9,\" \",E10,\"p\",MIN(A10-A$9,6))","v":"[He] 2s2 2p1"},"[He] 2s2 2p1",1.17,0.23,0.82,null,null,85,null,null,41,4.6,"rhombohedral","7440-42-8",1e-12,1.02,50.2,489.7,27,10,4.44,7e-05,"sublimes","Na and Ca borates (misc)","black","B12 icosahedra; 3 forms","special: B12 icosahedra",9.5,"borax, glass making(B2O3)","mild, w/ht =>B2O3","none","none","none","none","B2H6 and many BxHy","B2O3","BCl3 and many BxCly",3,573,1808,{"v":1.3263358609287514,"d":"1.326"},1,250]
[6,"C",14,"IV A",2,"carbon","Kohlenlstoff","carbone","carbono","carbonio",{"$f":"TEXT(ROUND(L11,2),\"0.00\")","v":"012"},12.0107,3367,4827,"solid",2.25,2.55,11.2603,24.383,47.887,1086,2353,4620,1.26,122,"±4","−4","[He] 2s2 2p2","[He] 2s2 2p2",0.91,0.16,0.77,null,null,77.2,{"$nulls":3},4.58,"hexagonal","7440-44-0",0.00061,0.71,"",355.8,129,200,28,23,"graphite","Coal,Petroleum,Natural gas","black","6 forms: graphite,diamond","hexagonal layers",0.8,"fuel(coal), lubricant","vigorous, =>CO2","none","none","mild,w/ht=>C6(COOH)6","none","CH4 and many CxHy","CO CO2","CCl4",1.8,717,null,{"v":7.004321373782642,"d":"7.004"},2.3,2.4,null,null,"no"]
[7,"N",15,"V A",2,"nitrogen","Stickstoff","azote","nitrógeno","azoto","014",14.0067,-209.9,-195.8,"gaseous",1.25E-3,3.04,14.5341,29.601,47.448,1402,2856,4578,"<0","<0","−3","−3","[He] 2s2 2p3","[He] 2s2 2p3",0.75,1.71,0.75,null,null,70,null,null,30,17.3,"hexagonal","77727-37-9","",1.04,0.3604,2.7928,0.02598,19,50,2.6,null,"Air","colorless","diatomic(N2)",null,null,"fertilizer, cryogenics","none","none","none","none","none","NH3 N2H4 HN3","N2O NO NO2 N2O5","NCl3",1.1,473,1772,{"v":6.4955443375464474,"d":"6.496"},1.3,0.4,null,"no","no"]
[8,"O",16,"VI A",2,"oxygen","Sauerstoff","oxygène","oxígeno","ossigeno","016",15.9994,-218.4,-183,"gaseous",0.00143,3.44,13.6181,35.117,54.934,1314,3388,5300,1.46,141,"−2","−2","[He] 2s2 2p4","[He] 2s2 2p4",0.65,1.4,0.73,126,null,73,{"$nulls":3},14,"cubic","7782-44-7","",0.92,0.22259,3.4099,0.02674,461000,857000,61,null,"Air","colorless","diatomic,2 forms: O2, O3",null,null,"rocket fuel, steel mfr.","none","none","none","none","none","H2O","O2 O3","Cl2O ClO2 Cl2O7",0.793,249,1774,{"v":7.376576957056512,"d":"7.377"},5.7,0.3,null,"no","no"]
[9,"F",17,"VII A",2,"fluorine","Fluor","fluor","flúor","fluoro","019",18.9984032,-219.8,-188.1,"gaseous",0.0017,3.98,17.4228,34.97,62.707,1681,3374,6050,{"v":3.4,"d":"3.40"},328,"−1","−1","[He] 2s2 2p5","[He] 2s2 2p5",0.57,1.33,0.72,null,119,72,{"$nulls":3},12.6,"cubic","7782-41-4","",0.82,0.2552,3.2698,0.0279,585,1.3,3.3E-3,null,"Fluorite (misc)","colorless","diatomic(F2), corrosive","layers of F2",null,"fluorocarbons, toothpaste","none","vigorous, =>HF, OF2","vigorous, =>HF, OF2, ClF3",null,"vigorous, =>O2, NaF","HF","OF2","ClF ClF3 ClF5",0.634,79,1886,{"v":2.925827574624742,"d":"2.926"},2.8,190,null,"yes","no"]
[10,"Ne",18,"VIII A",2,"neon","Neon","néon","neón","neon","020",20.1797,-248,-248.7,"gaseous",0.0009,null,21.5645,40.962,63.45,2081,3952,6122,"<0","<0","0",null,"[He] 2s2 2p6","[He] 2s2 2p6",0.51,"",0.71,null,null,71,{"$nulls":3},17.3,"cubic: face centered","7440-01-9","",0.904,0.3317,1.7326,0.0493,0.005,1.2E-4,null,null,"Air","colorless","Inert, dens<air at r.t.","fcc: face-centered cubic",null,"Neon signs","none","none","none","none","none","none","none","none",0.396,0,1898,{"v":6.53655844257153,"d":"6.537"},-2.3,33,null,"no","no"]
[11,"Na",1,"I A",3,"sodium","Natrium","sodium","sodio","sodio","023",22.98976928,97.8,883,"solid",0.971,0.93,5.1391,47.286,71.641,496,4562,6912,0.55,53,"+1","+1",{"$f":"CONCATENATE(\"[\",B$15,\"] \",E16,\"s\",MIN(A16-A$15,2))","v":"[Ne] 3s1"},"[Ne] 3s1",2.23,1.02,1.54,null,null,186,116,null,null,23.7,"cubic: body centered","7440-23-5",0.21,1.23,2.598,96.96,141,0.000236,10800,0.14,null,"Halite (misc)","silvery","soft","bcc: body-centered cubic",0.4,"lamps, table salt","vigorous, =>Na2O2","vigorous, =>H2, NaOH","vigorous, =>H2, NaCl","vigorous, =>NaNO3, NOx","vigorous, =>H2, NaOH","NaH","Na2O","NaCl",23.6,109,1807,{"v":4.758911892397973,"d":"4.759"},4.4,7]
[12,"Mg",2,"II A",3,"magnesium","Magnesium","magnésium","magnesio","magnesio","024",24.305,649,1090,"solid",1.74,1.31,7.6462,15.035,80.143,738,1451,7733,"<0","<0","+2","+2",{"$f":"CONCATENATE(\"[\",B$15,\"] \",E17,\"s\",MIN(A17-A$15,2))","v":"[Ne] 3s2"},"[Ne] 3s2",1.72,0.72,1.36,null,null,160,null,86,null,13.97,"hexagonal","7439-95-4",0.226,1.02,8.954,127.4,156,23300,1290,0.027,null,"Seawater, magnesite","silvery","burns brightly","hcp: hexagonal close pkd",2,"alloys, flash bulbs","vigorous,w/ht =>MgO,Mg3N2","mild, w/ht =>Mg(OH)2, H2","mild, =>H2, MgCl2","vigorous, =>NOx, Mg(NO3)2","none","MgH2","MgO","MgCl2",10.6,148,1808,{"v":6.031004281363536,"d":"6.031"},4.4,3.7,0.32]
[13,"Al",13,"III A",3,"aluminum","Aluminium","aluminium","aluminio","alluminio","027",26.9815386,660,2467,"solid",2.7,1.61,5.9858,18.828,28.447,578,1817,2745,0.44,42,"+3","+3",{"$f":"CONCATENATE(AB$17,\" \",E18,\"p\",MIN(A18-A$17,6))","v":"[Ne] 3s2 3p1"},"[Ne] 3s2 3p1",1.82,0.54,1.18,null,null,143,null,null,67.5,10,"cubic: face centered","7429-90-5",0.377,0.9,10.79,293.4,237,82300,2E-3,9e-05,null,"Bauxite (oxide)","silvery","passivated: surface oxide","fcc: face-centered cubic",2.8,"Al cans & foil,reflectors","mild, w/ht =>Al2O3","none","mild, =>H2, AlCl3","passivated","mild, =>H2, [Al(OH)4]-","AlH3","Al2O3","AlCl3Al2Cl6",8.3,326,1825,{"v":4.928907690243952,"d":"4.929"},4.9,1.8,0.12,null,"no"]
[14,"Si",14,"IV A",3,"silicon","Silizium","silicium","silicio","silicio","028",28.0855,1410,2355,"solid",2.33,1.9,8.1517,16.345,33.492,787,1577,3231,1.39,134,"±4","−4","[Ne] 3s2 3p2","[Ne] 3s2 3p2",1.46,0.26,1.11,null,null,117.6,{"$nulls":3},12.1,"cubic: face centered","7440-21-3",2.52e-12,0.71,50.55,384.22,148,282000,2.2,0.026,null,"Quartz (oxide)","gray-black","semimetal","diamond ",7,"comp chip,lubricant,glass","mild, =>SiO2","none","none","none","mild, =>silicates","SiH4 Si2H6 + more","SiO2","SiCl4 Si2Cl6 + more",5.4,452,1824,{"v":6,"d":"6.000"},5.5,5.4,0.14,null,"no"]
[15,"P",15,"V A",3,"phosphorus","Phosphor","phosphore","fósforo","fosforo","031",30.973762,44.1,280,"solid",1.82,2.19,10.4867,19.725,30.18,1012,1903,2912,0.75,72,"−3","−3","[Ne] 3s2 3p3","[Ne] 3s2 3p3",1.23,0.17,1.06,null,null,110,null,null,58,17,"monoclinic","7723-14-0",1e-17,0.77,0.657,12.129,0.235,1050,0.06,1.1,"white","Apatite (phosphate)","white-yellow","(P4) pyrophoric, 15 forms","special: P4 tetrahedra",0.5,"fertilizer, detergents","vigorous,=>P4O10, ignites","none","none","mild, =>NOx","mild, =>PH3, may ignite","PH3 P2H4 + more","P4O10 P4O6","PCl3 PCl5 P2Cl4",3.6,315,1669,{"v":4.01703333929878,"d":"4.017"},3,4,null,"yes","no"]
[16,"S",16,"VI A",3,"sulfur","Schwefel","soufre","azufre","zolfo","032",32.065,112.8,444.7,"solid",2.07,2.58,10.36,23.33,34.83,1000,2251,3361,2.08,201,"−2","−2","[Ne] 3s2 3p4","[Ne] 3s2 3p4",1.09,0.29,1.02,170,null,103,{"$nulls":3},15.5,"orthorhombic","7704-34-9",5e-24,0.71,1.7175,"",0.269,350,905,0.2,"yellow","Sulfur,pyrite,natural gas","yellow(pale)","(S8)brittle, 19 forms","S8 rings",2,"rubber, batteries (H2SO4)","vigorous, w/ht =>SO2","none","none","mild, =>H2SO4, NOx","none","H2S","SO2 SO3","S2Cl2 SCl2",2.9,279,null,{"v":5.711807229041191,"d":"5.712"},2.4,24]
[17,"Cl",17,"VII A",3,"chlorine","Chlor","chlore","cloro","cloro","035",35.453,-101,-34.6,"gaseous",0.00321,3.16,12.9676,23.81,39.611,1251,2297,3822,3.61,348,"−1","−1","[Ne] 3s2 3p5","[Ne] 3s2 3p5",0.97,1.81,0.99,null,167,100,{"$nulls":3},16.9,"orthorhombic","7782-50-5","",0.48,3.23,10.2,0.0089,145,19400,0.12,null,"Halite, brine (misc)","greenish-yellow","diatomic(Cl2), corrosive","layers of Cl2",null,"bleach (NaOCl), PVC pipe","none","mild,=>HOCl, Cl-, Cl2(aq)","mild, =>HOCl, Cl-","mild, =>HClOx, NOxCl, NOx","mild, =>OCl-, Cl-","HCl","Cl2O ClO2 Cl2O7","Cl2",2.2,121,1774,{"v":3.719331286983726,"d":"3.719"},2.1,0.15,null,"yes","no"]
[18,"Ar",18,"VIII A",3,"argon","Argon","argon","argón","argo","040",39.948,-189.2,-185.7,"gaseous",0.00178,null,15.7596,27.629,40.74,1521,2666,3931,"<0","<0","0",null,"[Ne] 3s2 3p6","[Ne] 3s2 3p6",0.88,"",0.98,null,null,98,{"$nulls":3},23.9,"cubic: face centered","7440-37-1","",0.52,1.188,6.447,0.01772,3.5,0.45,null,null,"Air","colorless","Inert","fcc: face-centered cubic",null,"lasers, light bulbs","none","none","none","none","none","none","none","none",1.586,0,1894,{"v":5.004321373782642,"d":"5.004"},0.5,0.5,null,"no","no"]
[19,"K",1,"I A",4,"potassium","Kalium","potassium","potasio","potassio","039",39.0983,63.25,760,"solid",0.86,0.82,4.3407,31.625,45.72,419,3051,4411,{"v":0.5,"d":"0.50"},48,"+1","+1",{"$f":"CONCATENATE(\"[\",B$23,\"] \",E24,\"s\",MIN(A24-A$23,2))","v":"[Ar] 4s1"},"[Ar] 4s1",2.77,1.51,2.03,null,null,227,152,null,null,45.46,"cubic: body centered","7440-09-7",0.139,0.75,2.334,79.87,102.4,20900,399,0.2,null,"Sylvite, carnallite (misc)","silvery-white","soft","bcc: body-centered cubic",0.5,"fertilizer, low-Na salt","vigorous, =>KO2","vigorous, =>H2, KOH","vigorous, =>H2, KCl","vigorous, =>H2, NOx, KNO3","vigorous, =>H2, KOH","KH","K2O","KCl",43.4,90,1807,{"v":3.576341350205792,"d":"3.576"},4.3,85]
[20,"Ca",2,"II A",4,"calcium","Kalzium","calcium","calcio","calcio","040",40.078,839,1484,"solid",1.55,1,6.1132,11.871,50.908,590,1145,4912,0.04,4,"+2","+2",{"$f":"CONCATENATE(\"[\",B$23,\"] \",E25,\"s\",MIN(A25-A$23,2))","v":"[Ar] 4s2"},"[Ar] 4s2",2.23,1,1.74,null,null,197,null,114,null,25.9,"cubic: face centered","7440-70-2",0.298,0.63,8.54,153.3,200,41500,412,1.4,null,"Calcite (oxide)","silvery-white","burns brightly","hcp: hexagonal close pkd",1.5,"lime, cement","vigorous, =>CaO, Ca3N2","mild, =>H2, Ca(OH)2","vigorous, =>H2, CaCl2","vigorous, =>H2, Ca(NO3)2","none","CaH2","CaO","CaCl2",22.8,178,1808,{"v":4.786041210242554,"d":"4.786"},4.65,11]
[21,"Sc",3,"III B",4,"scandium","Skandium","scandium","escandio","scandio","045",44.955912,1541,2832,"solid",2.99,1.36,6.5614,12.8,24.76,633,1235,2389,0.19,18,"+3","+3",{"$f":"CONCATENATE(AB$25,\" \",E26-1,\"d\",MIN(A26-A$25,10))","v":"[Ar] 4s2 3d1"},"[Ar] 4s2 3d1",2.09,0.75,1.44,null,null,162,null,null,88.5,15,"hexagonal","7440-20-2",0.0177,0.6,14.1,314.2,15.8,22,6e-07,null,null,"U extractn by-product","silvery-white","soft","hcp: hexagonal close pkd",null,"no significant uses","vigorous, =>Sc2O3","mild, =>H2, Sc(OH)3","mild, =>H2, ScCl3","mild, =>Sc(NO3)3",null,"ScH2 ScH3","Sc2O3","ScCl3",17.8,378,1879,{"v":1.534026106056135,"d":"1.534"},1.3,1400]
[22,"Ti",4,"IV B",4,"titanium","Titan","titane","titanio","titanio","048",47.867,1660,3287,"solid",4.54,1.54,6.8282,13.58,27.491,659,1310,2652,0.08,8,"+4,3,2","+4,3,2","[Ar] 4s2 3d2","[Ar] 4s2 3d2",2,0.61,1.32,null,null,147,null,100,81,10.64,"hexagonal","7440-32-6",0.0234,0.52,15.45,421,21.9,5650,1E-3,null,null,"Ilmenite, rutile(oxide)","gray","max strength/weight ratio","hcp: hexagonal close pkd",null,"steel,white pigment(TiO2)","mild, w/ht =>TiO2, TiN","none","none","passivated","none","TiH2","TiO Ti2O3 TiO2 + more","TiCl2 TiCl3 TiCl4",14.6,470,1791,{"v":3.380211241711606,"d":"3.380"},3.8,6.1]
[23,"V",5,"V B",4,"vanadium","Vanadium","vanadium","vanadio","vanadio","051",50.9415,1890,3380,"solid",6.11,1.63,6.7463,14.65,29.31,651,1414,2828,0.53,51,"+5,2,3,4","+5,2,3,4","[Ar] 4s2 3d3","[Ar] 4s2 3d3",1.92,0.54,1.22,null,null,134,null,93,78,8.78,"cubic: body centered","7440-62-2",0.0489,0.49,20.9,0.452,30.7,120,0.0025,null,null,"U, Pb vanadates (misc)","bright white","soft","bcc: body-centered cubic",null,"tool steel, V2O5 catalyst","mild, w/ht =>V2O5, VN","none","none","mild","none","VH VH2","VO V2O3 VO2 V2O5","VCl2 VCl3 VCl4",12.4,514,1830,{"v":2.4668676203541096,"d":"2.467"},2.1,220,null,"yes"]
[24,"Cr",6,"VI B",4,"chromium","Chrom","chrome","cromo","cromo","052",51.9961,1857,2672,"solid",7.19,1.66,6.7666,16.5,30.96,653,1592,2987,0.67,65,"+3,2,6","+3,2,6","[Ar] 4s2 3d4","[Ar] 4s1 3d5",1.85,0.62,1.18,null,null,128,null,90.5,75.5,7.23,"cubic: body centered","7440-47-3",0.0774,0.45,16.9,344.3,93.7,102,0.0003,3e-06,null,"Chromite (oxide)","silvery-white","hard","bcc: body-centered cubic",9,"CrO2 tape, paint, steel","none","none","mild, =>H2, CrCl3","passivated",null,"CrH","Cr2O3 CrO2 CrO3+non-stoich","CrCl2 CrCl3",11.6,397,1798,{"v":4.130333768495006,"d":"4.130"},2,10]
[25,"Mn",7,"VII B",4,"manganese","Mangan","manganèse","manganeso","manganese","055",54.938045,1244,1962,"solid",7.43,1.55,7.434,15.64,33.667,717,1509,3248,"<0","<0","+2,3,4,6,7","+2,3,4,6,7","[Ar] 4s2 3d5","[Ar] 4s2 3d5",1.79,0.67,1.17,null,null,127,null,89,75.3,7.39,"cubic: body centered","7439-96-5",0.00695,0.48,12.05,266,7.82,950,0.0002,2e-05,null,"Pyrolusite,psilomelane(oxide)","gray-white","hard, brittle","special:complex (cubic)",5,"steel, dry cells(MnO2)","mild, w/ht =>Mn3O4, Mn3N2","none","mild, =>H2, MnCl2","mild, =>Mn(NO3)2, NOx",null,"none","MnO Mn3O4 Mn2O3 MnO2 Mn2O7","MnCl2",9.4,281,1774,{"v":3.980003371583746,"d":"3.980"},3,1.7,null,null,"no"]
[26,"Fe",8,"VIII B",4,"iron","Eisen","fer","hierro","ferro","056",55.845,1535,2750,"solid",7.86,1.83,7.9024,16.18,30.651,762,1561,2957,{"v":0.151,"d":"0.15"},15,"+3,2","+3,2","[Ar] 4s2 3d6","[Ar] 4s2 3d6",1.72,0.55,1.17,null,null,126,null,83.5,73.8,7.1,"cubic: body centered","7439-89-6",0.0993,0.44,13.8,349.6,80.2,56300,2E-3,0.006,null,"Hematite,magnetite(oxide)","gray","fairly soft when pure","bcc: body-centered cubic",4.5,"steel","mild, =>Fe3O4","none","mild, =>H2, FeCl2","passivated",null,"none","FeO Fe3O4 Fe2O3","FeCl2 FeCl3",8.4,418,null,{"v":5.954242509439324,"d":"5.954"},4.8,6.7,0.021]
[27,"Co",9,"VIII B",4,"cobalt","Kobalt","cobalt","cobalto","cobalto","059",58.933195,1495,2870,"solid",8.9,1.88,7.881,17.06,33.5,760,1646,3232,0.66,64,"+2,3","+2,3","[Ar] 4s2 3d7","[Ar] 4s2 3d7",1.67,0.65,1.16,null,null,125,null,83.8,71.8,6.7,"hexagonal","7440-48-4",0.172,0.42,16.19,376.5,100,25,2e-05,2e-06,null,"Co sulfides & arsenides","bluish-white","hard","hcp: hexagonal close pkd",null,"magnets, Co glass (blue)","mild, w/ht =>Co3O4","none","mild, =>H2, CoCl2","vigorous, =>Co(NO3)2, NOx",null,"none","CoO Co3O4","CoCl2",7.5,425,1737,{"v":3.3521825181113623,"d":"3.352"},1.4,21,null,null,"yes"]
[28,"Ni",10,"VIII B",4,"nickel","Nickel","nickel","níquel","nichelio","059",58.6934,1453,2730,"solid",8.9,1.91,7.6398,18.168,35.17,737,1753,3393,1.16,112,"+2,3","+2,3","[Ar] 4s2 3d8","[Ar] 4s2 3d8",1.62,0.69,1.15,null,null,124,null,83,72,6.59,"cubic: face centered","7440-02-0",0.143,0.44,17.47,370.4,90.7,84,5.6e-14,1e-05,null,"sulfides, oxide/silicates","silvery-white","hard, takes a high polish","fcc: face-centered cubic",null,"alloys, coins, batteries","mild, w/ht =>NiO","none","mild, =>H2, NiCl2","passivated","none","NiH","NiO","NiCl2",6.8,430,1751,{"v":4.69284691927723,"d":"4.693"},1.9,7.7,0.76,"yes","yes"]
[29,"Cu",11,"I B",4,"copper","Kupfer","cuivre","cobre","rame","064",63.546,1083,2567,"solid",8.96,1.9,7.7264,20.292,36.83,745,1958,3554,1.24,120,"+2,1","+2,1","[Ar] 4s2 3d9","[Ar] 4s1 3d10",1.57,0.73,1.17,null,null,128,91,87,68,7.1,"cubic: face centered","7440-50-8",0.596,0.38,13.05,300.3,401,60,2.5e-14,1E-4,null,"Cu pyrite,chalcocite(sulfide)","orange-red","soft, ductile","fcc: face-centered cubic",2.75,"wire, bronze, coins","mild, w/ht =>CuO, Cu2O","none","none","mild, =>Cu(NO3)2, NOx",null,"CuH","Cu2O CuO","CuCl CuCl2",6.7,338,null,{"v":2.717670503002262,"d":"2.718"},1.7,2.7,0.24,null,"no"]
[30,"Zn",12,"II B",4,"zinc","Zink","zinc","zinc","zinco","065",65.409,419.6,906,"solid",7.13,1.65,9.3941,17.964,39.722,906,1733,3833,"<0","<0","+2","+2","[Ar] 4s2 3d10","[Ar] 4s2 3d10",1.53,0.74,1.25,null,null,134,null,88,null,9.2,"hexagonal","7440-66-6",0.166,0.39,7.322,115.3,116,70,0.0049,3.3E-3,null,"Sphalerite (sulfide)","silvery","brittle","distorted hcp structure",2.5,"batteries, galvanizing","vigorous, =>ZnO","none","mild, =>H2, ZnCl2","vigorous, =>Zn(NO3)2, NOx","mild, =>[Zn(OH)4](2-), H2","ZnH2","ZnO","ZnCl2",6.4,131,1600,{"v":3.1003705451175625,"d":"3.100"},1.79,3.7,0.12,null,"no"]
[31,"Ga",13,"III A",4,"gallium","Gallium","gallium","galio","gallio","070",69.723,29.8,2403,"solid",5.9,1.81,5.9993,20.51,30.71,579,1979,2963,{"v":0.3,"d":"0.30"},29,"+3","+3",{"$f":"CONCATENATE(AB$35,\" \",E36,\"p\",MIN(A36-A$35,6))","v":"[Ar] 4s2 3d10 4p1"},"[Ar] 4s2 3d10 4p1",1.81,0.62,1.26,null,null,135,null,null,76,11.8,"orthorhombic","7440-55-3",0.0678,0.37,5.59,258.7,40.6,19,3e-05,null,null,"Bauxite (oxide)","silvery-blue","melts near r.t.wets glass","special: complex",1.5,"photocells, transistors","mild, =>Ga2O3","none","mild, =>GaCl3, H2",null,"mild, =>[Ga(OH)4]2-, H2","GaH3","Ga2O3","GaCl Ga2Cl6",8.1,286,1875,{"v":1.5774917998372253,"d":"1.577"},1.2,220]
[32,"Ge",14,"IV A",4,"germanium","Germanium","germanium","germanio","germanio","073",72.64,947.4,2830,"solid",5.32,2.01,7.9,15.934,34.22,762,1537,3302,1.23,119,"+4,2","+4,2","[Ar] 4s2 3d10 4p2","[Ar] 4s2 3d10 4p2",1.52,0.53,1.22,null,null,122.3,null,87,null,13.6,"cubic: face centered","7440-56-2",1.45e-08,0.32,36.94,330.9,59.9,1.5,5e-05,null,null,"Zn smelting by-product","gray-black","semimetal, brittle","diamond",null,"transistor, wide-ang lens","mild, w/ht =>GeO2","none","none","mild, =>Ge(IV), NOx","none","GeH4 Ge2H6 + more","GeO GeO2","GeCl2 GeCl4",6.1,377,1886,{"v":2.0755469613925306,"d":"2.076"},0.7,360]
[33,"As",15,"V A",4,"arsenic","Arsen","arsenic","arsénico","arsenico","075",74.9216,817,617,"solid",5.73,2.18,9.8152,18.633,28.351,947,1798,2735,0.81,78,"±3,+5","−3","[Ar] 4s2 3d10 4p3","[Ar] 4s2 3d10 4p3",1.33,0.58,1.2,null,null,120,null,null,72,13.1,"rhombohedral","7440-38-2",0.0345,0.33,"",34.76,50,1.8,0.0037,null,"sublimes (28 atm) ","Arsenopyrite, enargite (misc)","gray","semimetal,brittle,3 forms","rhombohedral",3.5,"photocells (GaAs), poisons","mild, w/ht =>As4O6","none","none","mild, w/ht =>H3AsO4, NOx","none","AsH3","As2O3","AsCl3 AsCl5",4.3,302,1600,{"v":0.8169038393756601,"d":"0.817"},0.3,320,null,null,"yes"]
[34,"Se",16,"VI A",4,"selenium","Selen","sélénium","selenio","selenio","079",78.96,217,685,"solid",4.79,2.55,9.7524,21.19,30.82,941,2045,2974,2.02,195,"+4,−2,+6","−2","[Ar] 4s2 3d10 4p4","[Ar] 4s2 3d10 4p4",1.22,0.5,1.16,184,null,119,{"$nulls":3},16.45,"hexagonal","7782-49-2",1e-12,0.32,6.694,37.7,2.04,0.05,0.0002,null,null,"Cu smelting by-product","black","6 forms","parallel chains",2,"Xerography, medicines","vigorous, w/ht =>SeO2",null,"none","mild, =>H2SeO3, NOx",null,"SeH2","SeO2 SeO3","Se2Cl2 Se4Cl16",3.8,227,1818,{"v":1.79309160017658,"d":"1.793"},-1.3,14,null,"yes","no"]
[35,"Br",17,"VII A",4,"bromine","Brom","brome","bromo","bromo","080",79.904,-7.2,58.8,"liquid",3.12,2.96,11.8138,21.8,36,1140,2103,3473,3.36,324,"±1,+5","−1","[Ar] 4s2 3d10 4p5","[Ar] 4s2 3d10 4p5",1.12,1.96,1.14,null,182,114,{"$nulls":3},25.6,"orthorhombic","7726-95-6","",0.473,5.286,15.438,0.122,2.4,67.3,2.9E-4,null,"Seawater, brines","red-brown","diatomic,corrosive,liquid","layers of Br2 ",null,"pesticides,photography","none","none, dissolves Br2(aq)","none, dissolves Br2(aq)",null,"mild, =>OBr-, Br-","HBr","Br2O BrO2","BrCl",3.1,112,1826,{"v":1.0718820073061253,"d":"1.072"},0.4,4.9,null,"yes","no"]
[36,"Kr",18,"VIII A",4,"krypton","Krypton","krypton","criptón","kripto","084",83.798,-157,-152,"gaseous",0.00374,3,13.9996,24.359,36.95,1351,2350,3565,"<0","<0","0",null,"[Ar] 4s2 3d10 4p6","[Ar] 4s2 3d10 4p6",1.03,"",1.12,null,null,112,{"$nulls":3},38.9,"cubic: face centered","7439-90-9","",0.248,1.638,9.029,0.00949,1E-4,0.00021,null,null,"Air","colorless","unreactive","fcc: face-centered cubic",null,"lamps, UV-laser","none","none","none","none","none","none","none","none",2.5,0,1898,{"v":1.6532125137753435,"d":"1.653"},-4,33,null,"no","no"]
[37,"Rb",1,"I A",5,"rubidium","Rubidium","rubidium","rubidio","rubidio","085",85.4678,38.9,686,"solid",1.53,0.82,4.1771,27.28,40,403,2632,3859,0.49,47,"+1","+1",{"$f":"CONCATENATE(\"[\",B$41,\"] \",E42,\"s\",MIN(A42-A$37,2))","v":"[Kr] 5s2"},"[Kr] 5s2",2.98,1.61,2.16,null,null,248,166,null,null,55.9,"cubic: body centered","7440-17-7",0.0779,0.363,2.192,72.216,58.2,90,0.12,0.00046,null,"Li extractn by-product","silvery-white","soft","bcc: body-centered cubic",0.3,"photocells","vigorous, =>RbO2","vigorous, =>H2, RbOH","vigorous, =>H2, RbCl","vigorous,=>RbNO3, H2, NOx","vigorous, =>H2, RbOH","RbH","Rb2O","RbCl",47.3,86,1861,{"v":0.8506462351830665,"d":"0.851"},2,1200]
[38,"Sr",2,"II A",5,"strontium","Strontium","strontium","estroncio","stronzio","088",87.62,769,1384,"solid",2.54,0.95,5.6948,11.03,43.6,549,1064,4207,0.11,11,"+2","+2",{"$f":"CONCATENATE(\"[\",B$41,\"] \",E43,\"s\",MIN(A43-A$37,2))","v":"[Kr] 5s2"},"[Kr] 5s2",2.45,1.26,1.91,null,null,215,null,132,null,33.7,"cubic: face centered","7440-24-6",0.0762,0.3,8.3,144,35.3,370,7.2,0.00046,null,"Celestite (sulfide)","silvery","tarnishes","hcp: hexagonal close pkd",1.8,"fireworks (red flame)","vigorous, =>SrO, Sr2N3","mild, =>H2, Sr(OH)2","vigorous, =>H2, SrCl2","vigorous, =>Sr(NO3)2, H2","none","SrH2","SrO","SrCl2",27.6,164,1808,{"v":1.3710678622717363,"d":"1.371"},2.6,100]
[39,"Y",3,"III B",5,"yttrium","Yttrium","yttrium","itrio","ittrio","089",88.90585,1523,3337,"solid",4.47,1.22,6.217,12.24,20.52,600,1181,1980,0.31,30,"+3","+3",{"$f":"CONCATENATE(\"[\",B$41,\"] \",E44,\"s\",MIN(A44-A$37,2),\" \",E44-1,\"d\",MIN(A44-A$43,10))","v":"[Kr] 5s2 4d1"},"[Kr] 5s2 4d1",2.27,1.02,1.62,null,null,180,null,null,104,19.8,"hexagonal","7440-65-5",0.0166,0.3,11.4,363,17.2,33,1.3e-05,null,null,"xenotime (phosphate)","silvery","forms protective oxide","hcp: hexagonal close pkd",null,"YAG laser, TV phosphor","vigorous, =>Y2O3","mild, =>H2, Y(OH)3","mild, =>H2, YCl3","vigorous, =>Y(NO3)3",null,"YH2 YH3","Y2O3","YCl3",22.7,423,1794,{"v":0.6665179805548809,"d":"0.667"},1.51,220,null,null,"no"]
[40,"Zr",4,"IV B",5,"zirconium","Zirkonium","zirconium","circonio","zirconio","091",91.224,1852,4377,"solid",6.51,1.33,6.6339,13.13,22.99,640,1267,2218,0.43,41,"+4","+4","[Kr] 5s2 4d2","[Kr] 5s2 4d2",2.16,0.84,1.45,null,null,160,{"$nulls":3},14.1,"hexagonal","7440-67-7",0.0236,0.27,16.9,58.2,22.7,165,3e-05,null,null,"Zircon (silicate)","grayish-white","hard, relatively inert","hcp: hexagonal close pkd",null,"deodorants, fuel rod clad","mild, w/ht =>Zr2O3","none","none","passivated","none","ZrH2","ZrO2","ZrCl3 ZrCl4",17.9,609,1789,{"v":1.0569048513364725,"d":"1.057"},2.24,16,16]
[41,"Nb",5,"VI B",5,"niobium","Niob","niobium","niobio","niobio","093",92.90638,2468,4742,"solid",8.57,1.6,6.7589,14.32,25.04,652,1382,2416,{"v":0.9,"d":"0.90"},87,"+5,3","+5,3","[Kr] 5s2 4d3","[Kr] 5s1 4d4",2.08,0.64,1.67,null,null,146,null,null,86,10.87,"cubic: body centered","7440-03-1",0.0693,0.26,26.4,682,53.7,20,1e-05,null,null,"columbite (oxide)","silvery-white","soft","bcc: body-centered cubic",null,"stainless steels, magnets","none, w/ht =>Nb2O3","none","none",null,"none","NbH NbH2","NbO NbO2 Nb2O5","NbCl3 NbCl4 NbCl5",15.7,726,1801,{"v":-0.15614457737683893,"d":"-0.156"},1.3,18]
[42,"Mo",6,"VI B",5,"molybdenum","Molybdän","molybdène","molibdeno","molibdeno","096",95.94,2617,4612,"solid",10.2,2.16,7.0924,16.461,27.16,684,1588,2621,0.75,72,"+6,3,5","+6,3,5","[Kr] 5s2 4d4","[Kr] 5s1 4d5",2.01,0.59,1.3,null,null,139,null,null,83,9.4,"cubic: body centered","7439-98-7",0.187,0.25,32,598,138,1.2,0.01,1e-05,null,"Molybdenite (sulfide)","silvery-white","very hard","bcc: body-centered cubic",null,"catalysts, tool steel","none, w/ht =>MoO3","none","none",null,null,"none","MoO2 MoO3","MoClx [x=2-6]",12.8,658,1781,{"v":0.4065401804339551,"d":"0.407"},0.2,11,null,null,"no"]
[43,"Tc",7,"VII B",5,"technetium","Technetium","technétium","tecnecio","tecnezio",{"$f":"TEXT(ROUND(L48,2),\"0\")","v":"98"},98,2172,4877,"solid",11.5,1.9,7.28,15.26,29.54,702,1472,2850,0.55,53,"+7,4,6","+7,4,6","[Kr] 5s2 4d5","[Kr] 5s2 4d5",1.95,"",1.27,null,null,136,{"$nulls":3},8.5,"hexagonal","7440-26-8",0.067,0.21,24,660,50.6,{"$nulls":4},"Synthetic (U fission)","silvery gray","Radioactive, man made","hcp: hexagonal close pkd",null,"medical imaging agents","mild, w/ht, =>Tc2O7","none","none","mild, =>HTcO4",null,"none","TcO2 Tc2O7","TcCl4",11.4,677,1939,{"$nulls":5},"no"]
[44,"Ru",8,"VIII B",5,"ruthenium","Ruthenium","ruthénium","rutenio","rutenio",{"$f":"TEXT(ROUND(L49,1),\"0.0\")","v":"101"},101.07,2310,3900,"solid",12.4,2.2,7.3605,16.76,28.47,710,1617,2747,1.05,101,"+4,3,6,8","+4,3,6,8","[Kr] 5s2 4d6","[Kr] 5s1 4d7",1.89,0.62,1.25,null,null,134,null,null,82,8.3,"hexagonal","7440-18-8",0.137,0.238,24,595,117,1E-3,7e-07,null,null,"nickel ores (sulfides)","silvery-white","hard","hcp: hexagonal close pkd",6.5,"catalysts","none below 800 deg.C","none","none","none",null,"none","RuO2 RuO4","RuCl2 RuCl3",9.6,643,1844,{"v":0.26951294421791633,"d":"0.270"},-3,1400]
[45,"Rh",9,"VIII B",5,"rhodium","Rhodium","rhodium","rodio","rodio",{"$f":"TEXT(ROUND(L50,1),\"0.0\")","v":"103"},102.9055,1966,3727,"solid",12.4,2.28,7.4589,18.08,31.06,720,1744,2997,1.14,110,"+3,4,6","+3,4,6","[Kr] 5s2 4d7","[Kr] 5s1 4d8",1.83,0.67,1.25,null,null,134,null,null,80.5,8.3,"cubic: face centered","7440-16-6",0.211,0.242,21.5,493,150,1E-3,{"$nulls":3},"nickel ores (sulfides)","silvery-white","forms hard coatings","fcc: face-centered cubic",null,"catalysts, elec. contacts","none, w/ht =>Rh2O3","none","none","none","none","none","Rh2O3 RhO2","RhCl3",8.6,556,1803,{"v":-0.4634415574284698,"d":"-0.463"},-3,13000,null,null,"no"]
[46,"Pd",10,"VIII B",5,"palladium","Palladium","palladium","paladio","palladio","106",106.42,1554,3140,"solid",12,2.2,8.3369,19.63,32.93,804,1894,3177,0.56,54,"+2,4","+2,4","[Kr] 5s2 4d8","[Kr] (5s0) 4d10",1.79,0.64,1.28,null,null,137,null,100,90,8.9,"cubic: face centered","7440-05-3",0.095,0.24,17.6,357,71.8,0.015,{"$nulls":3},"nickel ores (sulfides)","silvery-white","absorbs H2","fcc: face-centered cubic",4.8,"catalysts, dental crowns","mild, w/ht, =>PdO","none","none","mild, =>Pd(NO3)2","none","PdHx x<1 non-stoich","PdO","PdCl2",4.8,378,1803,{"v":0.14301480025409502,"d":"0.143"},-2,15,290]
[47,"Ag",11,"I B",5,"silver","Silber","argent","plata","argento","108",107.8682,962,2212,"solid",10.5,1.93,7.5762,21.49,34.83,731,2073,3361,{"v":1.3,"d":"1.30"},125,"+1","+1","[Kr] 5s2 4d9","[Kr] 5s1 4d10",1.75,1.15,1.34,null,null,144,129,108,89,10.3,"cubic: face centered","7440-22-4",0.63,0.235,11.3,250.58,429,0.075,4e-05,null,null,"Argentite (sulfide)","silvery","soft, ductile, tarnishes","fcc: face-centered cubic",3.25,"film(AgBr),coins,jewelry","mild, =>Ag2O","none","none","mild, =>AgNO3",null,"none","Ag2O","AgCl",7.9,284,null,{"v":-0.31336373073770657,"d":"-0.313"},-1.2,120,14,null,"no"]
[48,"Cd",12,"II B",5,"cadmium","Kadmium","cadmium","cadmio","cadmio","112",112.411,320.9,765,"solid",8.65,1.69,8.9937,16.908,37.48,868,1631,3616,"<0","<0","+2","+2",{"$f":"CONCATENATE(\"[\",B$41,\"] \",E53,\"s\",MIN(A53-A$37,2),\" \",E53-1,\"d\",MIN(A53-A$43,10))","v":"[Kr] 5s2 4d10"},"[Kr] 5s2 4d10",1.71,0.95,1.48,null,null,151,null,109,null,13.1,"hexagonal","7440-43-9",0.138,0.23,6.192,99.57,96.8,0.15,1.1E-4,7e-05,null,"Sphalerite (sulfide)","bluish-white","soft","distorted hcp structure",2,"battery,yel. pigment(CdS)","mild, w/ht =>CdO","none","mild, =>H2, Cd(Cl)2","mild, =>Cd(NO3)2, NOx","none",null,"CdO","CdCl2",7.2,112,1817,{"v":0.2068258760318497,"d":"0.207"},-0.7,6,null,null,"yes"]
[49,"In",13,"III A",5,"indium","Indium","indium","indio","indio","115",114.818,156.6,2080,"solid",7.31,1.78,5.7864,18.869,28.03,558,1821,2704,{"v":0.3,"d":"0.30"},29,"+3","+3",{"$f":"CONCATENATE(\"[\",B$41,\"] \",E54,\"s\",MIN(A54-A$37,2),\" \",E54-1,\"d\",MIN(A54-A$43,10),\" \",E54,\"p\",MIN(A54-A$53,6))","v":"[Kr] 5s2 4d10 5p1"},"[Kr] 5s2 4d10 5p1",2,0.8,1.44,null,null,167,null,null,94,15.7,"tetragonal","7440-74-6",0.116,0.23,3.263,231.5,81.6,0.25,2E-3,null,null,"Zn/Pb smelting by-product","silvery-white","soft","distorted fcc structure",1.2,"transistors, photocells","mild, =>In2O3",null,"mild, =>H2, InCl3","mild, =>In(NO3)3","none",null,"In2O3","InCl InCl3",9.7,243,1863,{"v":-0.7351821769904634,"d":"-0.735"},-1,120,null,null,"no"]
[50,"Sn",14,"IV A",5,"tin","Zinn","Étain","estaño","stagno","119",118.71,232,2270,"solid",7.31,1.96,7.3438,14.632,30.502,709,1412,2943,1.11,107,"+4,2","+4,2","[Kr] 5s2 4d10 5p2","[Kr] 5s2 4d10 5p2",1.72,0.71,1.41,null,null,140.5,{"$nulls":3},16.3,"tetragonal","7440-31-5",0.0917,0.227,7.029,295.8,66.6,2.3,4e-06,2e-05,null,"Cassiterite (oxide)","silvery-white","resists corrosion;2 forms","distorted diamond",1.65,"solder, pewter, bronze","mild, w/ht, =>SnO2","none","none","mild, =>SnO2, NOx","mild, =>H2, [Sn(OH)6] 2-","SnH4 Sn2H6","SnO SnO2","SnCl2 SnCl4",7.7,302,null,{"v":0.5820633629117087,"d":"0.582"},0.3,8,0.83,null,"no"]
[51,"Sb",15,"V A",5,"antimony","Antimon","antimoine","antimonio","antimonio","122",121.76,631,1950,"solid",6.69,2.05,8.64,16.53,25.3,834,1595,2441,1.07,103,"+3,5","+3,5","[Kr] 5s2 4d10 5p3","[Kr] 5s2 4d10 5p3",1.53,0.76,1.4,null,null,140,null,null,90,18.23,"rhombohedral","7440-36-0",0.0288,0.21,19.87,77.14,24.3,0.2,0.00024,null,null,"Stibnite (sulfide)","bluish-white","brittle; 5 forms","rhombohedral",3.15,"Pb alloy(battery), dyeing","mild, w/ht, =>Sb2Ox x=3-5","none","none","mild, =>Sb2O5","none","SbH3","Sb2O3 Sb2O4 Sb2O5","SbCl3 SbCl5",6.6,262,1600,{"v":-0.5100415205751653,"d":"-0.510"},-0.7,4.5,0.44,null,"no"]
[52,"Te",16,"VI A",5,"tellurium","Tellur","tellure","teluro","tellurio","128",127.6,449.5,989.8,"solid",6.24,2.1,9.0096,18.6,27.96,869,1795,2698,1.97,190,"+4,6,−2","−2","[Kr] 5s2 4d10 5p4","[Kr] 5s2 4d10 5p4",1.43,0.97,1.36,207,null,142,{"$nulls":3},20.5,"hexagonal","13494-80-9",2e-06,0.2,17.49,52.55,2.35,1E-3,{"$nulls":3},"Zn/Pb smelting by-product","silvery","semimetal","parallel chains",2.3,"semiconductors, steel","mild, w/ht, =>TeO2","none","none","mild, =>Te(IV)",null,"H2Te","TeO2 TeO3","Te2Cl Te3Cl2 Te4Cl16",5.5,197,1783,{"v":0.6821450763738317,"d":"0.682"},-3,24,null,"yes","no"]
[53,"I",17,"VII A",5,"iodine","Iod (Jod)","iode","yodo","iodio","127",126.90447,113.5,184,"solid",4.93,2.66,10.4513,19.131,33,1008,1846,3184,3.06,295,"−1,+5,7","−1","[Kr] 5s2 4d10 5p5","[Kr] 5s2 4d10 5p5",1.32,2.2,1.33,null,206,133,{"$nulls":3},25.74,"orthorhombic","7553-56-2",8e-16,0.214,7.824,20.752,0.449,0.45,0.06,2e-05,null,"Brines, Chilean nitrate (misc)","bluish-black","diatomic","layers of I2",null,"nutrient, antiseptic","none","none, dissolves slightly","none","mild, =>HIO3","mild, =>OI-, I-","HI","I2O5 I4O9 I2O4","ICl ICl3",5,107,1811,{"v":-0.045757490560675115,"d":"-0.046"},-0.3,8.3,null,"yes","no"]
[54,"Xe",18,"VIII A",5,"xenon","Xenon","xénon","xenón","xeno","131",131.293,-111.8,-107.1,"gaseous",0.00589,2.6,12.1299,21.21,32.1,1170,2046,3097,"<0","<0","0",null,"[Kr] 5s2 4d10 5p6","[Kr] 5s2 4d10 5p6",1.24,"",1.31,null,null,131,{"$nulls":3},37.3,"cubic: face centered","7440-63-3","",0.158,2.297,12.636,0.00569,3e-05,5e-05,null,null,"Air","colorless","unreactive","fcc: face-centered cubic",null,"UV-laser, hi intens lamps","none","none","none","none","none","none","XeO3 XeO4","none",4,0,1898,{"v":0.6720978579357174,"d":"0.672"},-4.5,120,null,"no","no"]
[55,"Cs",1,"I A",6,"cesium","Zäsium","césium","cesio","cesio","133",132.9054519,28.4,669,"solid",1.87,0.79,3.8939,25.1,null,376,2422,"",0.47,45,"+1","+1",{"$f":"CONCATENATE(\"[\",B$59,\"] \",E60,\"s\",MIN(A60-A$59,2))","v":"[Xe] 6s1"},"[Xe] 6s1",3.34,1.74,2.35,null,null,265,181,null,null,71.07,"cubic: body centered","7440-46-2",0.0489,0.24,2.092,67.74,59,3,0.0003,2e-06,null,"Li extractn by-product","yellow/silvery","softest metal","bcc: body-centered cubic",0.2,"photocells, IR lamps","vigorous, =>CsO2","vigorous, =>H2, CsOH","vigorous, =>H2, CsCl","vigorous, =>CsNO3","vigorous, =>H2, CsOH","CsH","Cs2O","CsCl",59.6,79,1860,{"v":-0.4294570601181025,"d":"-0.429"},0,1100]
[56,"Ba",2,"II A",6,"barium","Barium","baryum","bario","bario","137",137.327,725,1640,"solid",3.5,0.89,5.2117,10.004,null,503,965,"",0.15,14,"+2","+2",{"$f":"CONCATENATE(\"[\",B$59,\"] \",E61,\"s\",MIN(A61-A$59,2))","v":"[Xe] 6s2"},"[Xe] 6s2",2.78,1.42,1.98,null,null,222,null,149,null,39.24,"cubic: body centered","7440-39-3",0.03,0.204,7.75,142,18.4,425,0.013,3e-05,null,"Barite (sulfate)","silvery-white","soft","bcc: body-centered cubic",null,"X-ray imaging agnt(BaSO4)","vigorous,wt/ht=>BaO,Ba2N3","vigorous, =>H2, Ba(OH)2","vigorous, =>H2, BaCl2","mild, =>Ba(NO3)2","passivated","BaH2","BaO","BaCl2",39.7,180,1808,{"v":0.6522463410033231,"d":"0.652"},2.6,55,null,null,"no"]
[57,"La","lanthanides","III B",6,"lanthanum","Lanthan","lanthane","lantano","lantanio","139",138.90547,920,3454,"solid",6.15,1.1,5.577,11.059,19.174,538,1067,1850,{"v":0.5,"d":"0.50"},48,"+3","+3",{"$f":"CONCATENATE(\"[\",B$59,\"] \",E62,\"s\",MIN(A62-A$59,2),\" \",E62-2,\"f\",MIN(A62-A$61,14))","v":"[Xe] 6s2 4f1"},"[Xe] 6s2 4f1",2.74,1.16,1.69,null,null,187,null,null,117.2,20.73,"hexagonal","7439-91-0",0.0126,0.19,6.2,414,13.5,39,3.4e-06,null,null,"Monazite(phosphate),bastnaesite","silvery-white","soft, malleable"," cp: close packed (ABCB)",null,"lighter flints, CRTs","vigorous, w/ht =>La2O3","mild, =>H2, La(OH)3","mild, =>H2, LaCl3","mild, =>La(NO3)3",null,"LaH2 LaH3","La2O3","LaCl3",31.1,423,1839,{"v":-0.3506651412878581,"d":"-0.351"},1.5,64]
[58,"Ce","lanthanides","lanthanides",6,"cerium","Zer","cérium","cerio","cerio","140",140.116,798,3257,"solid",6.66,1.12,5.5387,10.851,20.2,534,1047,1949,null,"","+3,4","+3,4",{"$f":"CONCATENATE(\"[\",B$59,\"] \",E63,\"s\",MIN(A63-A$59,2),\" \",E63-2,\"f\",MIN(A63-A$61,14))","v":"[Xe] 6s2 4f2"},"[Xe] 6s2 4f2",2.7,1.14,1.65,null,null,182,null,null,115,20.67,"cubic: face centered","7440-45-1",0.0115,0.19,5.46,414,11.4,66.5,1.2e-06,null,null,"Monazite(phosphate),bastnaesite","silvery-white","malleable","fcc: face-centered cubic",null,"self-cleaning ovens(CeO2)","vigorous, w/ht =>CeO2","mild, =>H2, Ce(OH)3","vigorous, =>H2, CeCl3","mild, =>Ce(NO3)3",null,"CeH2 CeH3","Ce2O3 CeO2","CeCl3",29.6,419,1803,{"v":0.05537833137500002,"d":"0.055"},1.8,57]
[59,"Pr","lanthanides","lanthanides",6,"praseodymium","Praseodym","praséodyme","prosedimio","praseodimio","141",140.90765,931,3017,"solid",6.77,1.13,5.464,10.551,21.62,527,1018,2086,null,"","+3,4","+3,4","[Xe] 6s2 4f3","[Xe] 6s2 4f3",2.67,1.13,1.65,null,null,182,null,null,113,20.8,"hexagonal","7440-10-0",0.0148,0.19,6.89,296.8,12.5,9.2,6.4e-07,null,null,"Monazite(phosphate),bastnaesite","silvery-white","soft"," cp: close packed (ABCB)",null,"alloys, Welder's mask","vigorous, =>Pr6O11 approx","mild, =>H2, Pr(OH)3","mild, =>H2, PrCl3","mild, =>Pr(NO3)3",null,"PrH2 PrH3","PrO2 Pr6O11","PrCl3",28.2,356,1885,{"v":-0.7775436633207532,"d":"-0.778"},0.9,170]
[60,"Nd","lanthanides","lanthanides",6,"neodymium","Neodym","néodyme","neodimio","neodimio","144",144.242,1016,3127,"solid",7,1.14,5.525,10.727,22.076,533,1035,2130,null,"","+3","+3","[Xe] 6s2 4f4","[Xe] 6s2 4f4",2.64,"",1.64,null,null,181,null,null,112.3,20.6,"hexagonal","7440-00-8",0.0157,0.19,7.14,273,16.5,41.5,2.8e-06,null,null,"Monazite(phosphate),bastnaesite","silvery-white",null," cp: close packed (ABCB)",null,"alloys, Welder's mask","vigorous, w/ht =>Nd2O3","mild, =>H2, Nd(OH)3","mild, =>H2, NdCl3","mild, =>Nd(NO3)3",null,"NdH2 NdH3","Nd2O3","NdCl2 NdCl3",31.4,328,1885,{"v":-0.08202211740709174,"d":"-0.082"},1.4,110]
[61,"Pm","lanthanides","lanthanides",6,"promethium","Promethium","prométhium","promecio","promezio",{"$f":"TEXT(ROUND(L66,1),\"0\")","v":"145"},145,1042,3000,"solid",7.26,null,5.55,10.903,22.283,535,1052,2150,null,"","+3","+3","[Xe] 6s2 4f5","[Xe] 6s2 4f5",2.62,1.07,1.63,null,null,183,null,null,111,22.39,"hexagonal","7440-12-2","",0.18,"","",17.9,{"$nulls":4},"Synthetic","silvery-white","Radioactive"," cp: close packed (ABCB)",null,"nuclear battery","vigorous, =>Pm2O3","mild, =>H2, Pm(OH)3","mild, =>H2, PmCl3","mild, =>Pm(NO3)3",null,null,"Pm2O3",null,30.1,301,1945,null,-19.3]
[62,"Sm","lanthanides","lanthanides",6,"samarium","Samarium","samarium","samario","samario",{"$f":"TEXT(ROUND(L67,1),\"0.0\")","v":"150"},150.36,1074,1794,"solid",7.52,1.17,5.6437,11.069,23.423,545,1068,2260,null,"","+3,2","+3,2","[Xe] 6s2 4f6","[Xe] 6s2 4f6",2.59,1.08,1.62,null,null,180,null,null,109.8,19.95,"rhombohedral","7440-19-9",0.00956,0.2,8.63,166.4,13.3,7.05,4.5e-07,null,null,"Monazite(phosphate),bastnaesite","silvery-white",null," cp: cls pkd (ABCBCACAB)",null,"alloys, headphones","vigorous, =>Sm2O3","mild, =>H2, Sm(OH)3","mild, =>H2, SmCl3","mild, =>Sm(NO3)3",null,"SmH2 SmH3","Sm2O3","SmCl2 SmCl3",28.8,207,1880,{"v":-0.5880437620695985,"d":"-0.588"},0.8,130]
[63,"Eu","lanthanides","lanthanides",6,"europium","Europium","europium","europio","europio","152",151.964,822,1529,"solid",5.24,null,5.6704,11.245,24.926,547,1085,2405,null,"","+3,2","+3,2","[Xe] 6s2 4f7","[Xe] 6s2 4f7",2.56,1.07,1.85,null,null,208,null,131,108.7,28.9,"cubic: body centered","7440-53-3",0.00112,0.18,9.21,143.5,13.9,2,1.3E-7,null,null,"Monazite(phosphate),bastnaesite","silvery-white","hard","bcc: body-centered cubic",null,"alloys, color TV phosphor","vigorous, =>Eu2O3","mild, =>H2, Eu(OH)3","mild, =>H2, EuCl3","mild, =>Eu(NO3)3",null,"EuH2","Eu2O3","EuCl2 EuCl3",27.7,178,1901,{"v":-1.0118871597316481,"d":"-1.012"},0.1,3600]
[64,"Gd","lanthanides","lanthanides",6,"gadolinium","Gadolinium","gadolinium","gadolineo","gadolinio","157",157.25,1313,3273,"solid",7.9,1.2,6.15,12.095,20.635,593,1167,1991,null,"","+3","+3","[Xe] 6s2 4f8","[Xe] 6s2 4f8",2.54,1.05,1.61,null,null,180,null,null,107.8,19.9,"hexagonal","7440-54-2",0.00736,0.23,10.05,359.4,10.6,6.2,7e-07,null,null,"Monazite(phosphate),bastnaesite","silvery-white",null,"hcp: hexagonal close pkd",null,"alloys, CD disk","vigorous, =>Gd2O3","mild, =>H2, Gd(OH)3","mild, =>H2, GdCl3","mild, =>Gd(NO3)3",null,"GdH2 GdH3","Gd2O3","GdCl3",23.5,398,1880,{"v":-0.4814860601221125,"d":"-0.481"},0.7,191]
[65,"Tb","lanthanides","lanthanides",6,"terbium","Terbium","terbium","terbio","terbio","159",158.92535,1365,3230,"solid",8.23,null,5.8939,11.525,21.91,569,1112,2114,null,"","+3,4","+3,4","[Xe] 6s2 4f9","[Xe] 6s2 4f9",2.51,1.18,1.59,null,null,177,null,null,106.3,19.2,"hexagonal","7440-27-9",0.00889,0.18,10.8,330.9,11.1,1.2,1.4e-07,null,null,"Monazite(phosphate),bastnaesite","silvery-white","soft","hcp: hexagonal close pkd",null,"alloys","vigorous, =>Tb4O7 (approx.)","mild, =>H2, Tb(OH)3","mild, =>H2, TbCl3","mild, =>Tb(NO3)3",null,"TbH2 TbH3","TbO2 Tb4O7","TbCl3",25.5,389,1843,{"v":-1.2196826878598486,"d":"-1.220"},0,1800]
[66,"Dy","lanthanides","lanthanides",6,"dysprosium","Dysprosium","dysprosium","disprosio","disprosio","163",162.5,1412,2567,"solid",8.55,1.22,5.9389,11.67,22.802,{"$f":"IF(COUNT(R71)=1,ROUND(R71*96.48538,0),\"\")","v":573},1126,2200,null,{"$f":"IF(COUNT(X71)=1,ROUND(X71*96.48538,0),IF(COUNTA(X71)=1,X71,\"\"))","v":""},"+3","+3","[Xe] 6s2 4f10",{"$f":"AB71","v":"[Xe] 6s2 4f10"},2.49,1.03,1.59,null,null,178,null,121,105.2,19,"hexagonal","7429-91-6",0.0108,0.17,11.06,230.1,10.7,5.2,9.1e-07,null,null,"Monazite(phosphate),bastnaesite","silvery-white","neutron absorber","hcp: hexagonal close pkd",null,"alloys, CD disk","vigorous, =>Dy2O3","mild, =>H2, Dy(OH)3","mild, =>H2, DyCl3","mild, =>Dy(NO3)3",null,"DyH2 DyH3","Dy2O3","DyCl2 DyCl3",24.5,291,1886,{"v":-0.40428338005657555,"d":"-0.404"},0.5,210]
[67,"Ho","lanthanides","lanthanides",6,"holmium","Holmium","holmium","holmio","olmio","165",164.93032,1474,2700,"solid",8.8,1.23,6.0216,11.805,22.843,581,1139,2204,null,"","+3","+3","[Xe] 6s2 4f11","[Xe] 6s2 4f11",2.47,"",1.58,null,null,176,null,null,104.1,18.8,"hexagonal","7440-60-0",0.0124,0.16,12.2,241,16.2,1.3,2.2e-07,null,null,"Monazite(phosphate),bastnaesite","silvery-white",null,"hcp: hexagonal close pkd",null,"alloys","vigorous, =>Ho2O3","mild, =>H2, Ho(OH)3","mild, =>H2, HoCl3","mild, =>Ho(NO3)3",null,"HoH2 HoH3","Ho2O3","HoCl3",23.6,301,1879,{"v":-1.0510982390297863,"d":"-1.051"},0.1,740]
[68,"Er","lanthanides","lanthanides",6,"erbium","Erbium","erbium","erbio","erbio","167",167.259,1529,2868,"solid",9.07,1.24,6.1078,11.929,22.739,589,1151,2194,null,"","+3","+3","[Xe] 6s2 4f12","[Xe] 6s2 4f12",2.45,1,1.57,null,null,176,null,null,103,18.4,"hexagonal","7440-52-0",0.0117,0.17,19.9,261,14.3,3.5,8.7e-07,null,null,"Monazite(phosphate),bastnaesite","silvery-white",null,"hcp: hexagonal close pkd",null,"alloys, photogr. filter","vigorous, =>Er2O3","mild, =>H2, Er(OH)3","mild, =>H2, ErCl3","mild, =>Er(NO3)3",null,"ErH2 ErH3","Er2O3","ErCl3",22.7,317,1843,{"v":-0.6006724678413211,"d":"-0.601"},0.4,270]
[69,"Tm","lanthanides","lanthanides",6,"thulium","Thulium","thulium","tulio","tulio","169",168.93421,1545,1950,"solid",9.32,1.25,6.1843,12.054,26.367,597,1163,2544,null,"","+3,2","+3,2","[Xe] 6s2 4f13","[Xe] 6s2 4f13",2.42,1.09,1.56,null,null,176,null,117,102,18.1,"hexagonal","7440-30-4",0.015,0.16,16.84,191,16.8,0.52,1.7e-07,null,null,"Monazite(phosphate),bastnaesite","silvery-white","soft","hcp: hexagonal close pkd",null,"alloys","vigorous, =>Tm2O3","mild, =>H2, Tm(OH)3","mild, =>H2, TmCl3","mild, =>Tm(NO3)3",null,"TmH2 TmH3","Tm2O3","TmCl2 TmCl3",21.8,232,1879,{"v":-1.4225082001627747,"d":"-1.423"},-0.3,4100]
[70,"Yb","lanthanides","lanthanides",6,"ytterbium","Ytterbium","ytterbium","iterbio","itterbio","173",173.04,819,1196,"solid",6.97,null,6.2542,12.188,25.03,603,1176,2415,null,"","+3,2","+3,2","[Xe] 6s2 4f14","[Xe] 6s2 4f14",2.4,0.99,1.74,null,null,193,null,116,100.8,24.79,"cubic: face centered","7440-64-4",0.0351,0.15,7.66,128.9,34.9,3.2,8.2e-07,null,null,"Monazite(phosphate),bastnaesite","silvery-white","soft","fcc: face-centered cubic",null,"alloys","vigorous, =>Yb2O3","mild, =>H2, Yb(OH)3","mild, =>H2, YbCl3","mild, =>Yb(NO3)3",null,"YbH2 Yb2H5","Yb2O3","YbCl2 YbCl3",21,152,1879,{"v":-0.6057234732321785,"d":"-0.606"},0.5,530]
[71,"Lu",3,"lanthanides",6,"lutetium","Lutetium","lutécium","lutecio","lutezio","175",174.967,1663,3402,"solid",9.84,1.27,5.4259,13.888,20.957,524,1340,2022,null,"","+3","+3",{"$f":"CONCATENATE(\"[\",B$59,\"] \",E76,\"s\",MIN(A76-A$59,2),\" \",E76-2,\"f\",MIN(A76-A$61,14),\" \",E76-1,\"d\",MIN(A76-A$75,10))","v":"[Xe] 6s2 4f14 5d1"},"[Xe] 6s2 4f14 5d1",2.25,0.98,1.56,null,null,174,null,null,100.1,17.78,"hexagonal","7439-94-3",0.0185,0.15,18.6,355.9,16.4,0.8,1.5e-07,null,null,"Monazite(phosphate),bastnaesite","silvery-white",null,"hcp: hexagonal close pkd",null,"alloys","vigorous, =>Lu2O3","mild, =>H2, Lu(OH)3","mild, =>H2, LuCl3","mild, =>Lu(NO3)3",null,"LuH2 LuH3","Lu2O3","LuCl3",21.9,null,1907,{"v":-1.4353339357479105,"d":"-1.435"},-0.3,6900]
[72,"Hf",4,"IV B",6,"hafnium","Hafnium","hafnium","hafnio","hafnio","179",178.49,2227,4600,"solid",13.3,1.3,6.8251,14.925,23.32,659,1440,2250,{"v":0,"d":"0.00"},0,"+4","+4","[Xe] 6s2 4f14 5d2","[Xe] 6s2 4f14 5d2",2.16,0.83,1.44,null,null,159,{"$nulls":3},13.6,"hexagonal","7440-58-6",0.0312,0.14,24.06,575,23,3,7e-06,null,null,"Zircon (silicate)","silvery","hard","hcp: hexagonal close pkd",null,"nuclear control rods","mild, w/ht, =>HfO2","none","none","passivated","none","HfH2","HfO2","HfCl3 HfCl4",16.2,619,1923,{"v":-0.8124792791635369,"d":"-0.812"},0.4,120,null,null,"no"]
[73,"Ta",5,"V B",6,"tantalum","Tantal","tantale","tántalo","tantalio","181",180.94788,2996,5425,"solid",16.6,1.5,7.89,null,null,761,"","",0.32,31,"+5","+5","[Xe] 6s2 4f14 5d3","[Xe] 6s2 4f14 5d3",2.09,0.64,1.34,null,null,146,null,null,86,10.9,"cubic: body centered","7440-25-7",0.0761,0.14,31.6,743,57.5,2,2e-06,null,null,"Tantalite (oxide)","gray","hard, inert at <100 deg.C","bcc: body-centered cubic",null,"surg. implants,heat exch.","none","none","none","none","none","TaH","TaO2 Ta2O5","TaCl3 TaCl4 TaCl5",13.1,782,1802,{"v":-1.684029654543082,"d":"-1.684"},0.3,120,null,null,"no"]
[74,"W",6,"VI B",6,"tungsten","Wolfram","tungstène","wolframio or tungsteno","tungsteno","184",183.84,3410,5660,"solid",19.3,2.36,7.98,null,null,770,"","",0.86,83,"+6,4","+6,4","[Xe] 6s2 4f14 5d4","[Xe] 6s2 4f14 5d4",2.02,0.6,1.3,null,null,139,{"$nulls":3},9.53,"cubic: body centered","7440-33-7",0.189,0.13,35.4,824,174,1.25,1E-4,null,null,"Scheelite,wolframite(oxide)","bluish-gray","highest melting metal","bcc: body-centered cubic",null,"WC drill bits, bulb wire","none, w/ht =>WO3","none","none",{"$nulls":3},"WO2 WO3","WClx [x=2-6]",11.1,849,1783,{"v":-0.876148359032914,"d":"-0.876"},0.2,11,null,null,"no"]
[75,"Re",7,"VII B",6,"rhenium","Rhenium","rhénium","renio","renio","186",186.207,3180,5600,"solid",21,1.9,7.88,null,null,760,"","",0.15,14,"+7,4,6","+7,4,6","[Xe] 6s2 4f14 5d5","[Xe] 6s2 4f14 5d5",1.97,0.53,1.28,null,null,137,{"$nulls":3},8.85,"hexagonal","7440-15-5",0.0542,0.13,33.2,715,47.9,0.0007,4e-06,null,null,"Molybdenite (sulfide)","silvery-white","high melting point","hcp: hexagonal close pkd",null,"catalysts, thermocouples","mild, w/ht =>Re2O7","none","none","mild, =>HReO4",null,"none","Re2O5 ReO3 Re2O7","Re3Cl9 ReCl4 ReCl5 ReCl6",9.7,770,1925,{"v":-1.2865094569060573,"d":"-1.287"},-2.3,540]
[76,"Os",8,"VIII B",6,"osmium","Osmium","osmium","osmio","osmio","190",190.23,3045,5030,"solid",22.6,2.2,8.7,null,null,839,"","",{"v":1.1,"d":"1.10"},106,"+4,6,8","+4,6,8","[Xe] 6s2 4f14 5d6","[Xe] 6s2 4f14 5d6",1.92,0.63,1.26,null,null,135,{"$nulls":3},8.49,"hexagonal","7440-04-02",0.109,0.13,31.8,746,87.6,1.5E-3,{"$nulls":3},"nickel ores (sulfides)","bluish-white","hard, dense, inert <100 C","hcp: hexagonal close pkd",7,"hard alloys,phono needles","none","none","none","mild, =>OsO4",null,"none","OsO2 OsO4","OsCl3 OsCl4 OsCl5",8.5,791,1804,{"v":-0.17069622716897503,"d":"-0.171"},-2.8,7700]
[77,"Ir",9,"VIII B",6,"iridium","Iridium","iridium","iridio","iridio","192",192.217,2410,4130,"solid",22.4,2.2,9.1,null,null,878,"","",1.57,151,"+4,3,6","+4,3,6","[Xe] 6s2 4f14 5d7","[Xe] 6s2 4f14 5d7",1.87,0.63,1.27,null,null,136,null,null,82,8.54,"cubic: face centered","7439-88-5",0.197,0.13,26.1,604,147,1E-3,{"$nulls":3},"nickel ores (sulfides)","white","hard, densest el, inert","fcc: face-centered cubic",6.25,"Pt/Ir sparkplugs","none","none","none","none","none","none","IrO2","IrCl3",7.6,665,1804,{"v":-0.17979854051435973,"d":"-0.180"},-3,4200]
[78,"Pt",10,"VIII B",6,"platinum","Platin","platine","platino","platino","195",195.084,1772,3827,"solid",21.4,2.28,9,18.563,null,868,1791,"",2.13,206,"+4,2","+4,2","[Xe] 6s2 4f14 5d8","[Xe] 6s2 4f14 5d8",1.83,0.63,1.3,null,null,139,null,94,null,9.1,"cubic: face centered","7440-06-4",0.0966,0.13,19.6,510,71.6,0.005,{"$nulls":3},"nickel ores (sulfides)","silvery-white","Inert, ductile","fcc: face-centered cubic",4.3,"jewelry, catalysts","none","none","none","none","none","none","PtO2","PtCl2 PtCl4",6.5,565,1748,{"v":0.12710479836480765,"d":"0.127"},-2.3,4700,1200,null,"no"]
[79,"Au",11,"I B",6,"gold","Gold","or","oro","oro","197",196.966569,1064,3080,"solid",19.3,2.54,9.2257,20.521,null,890,1980,"",2.31,223,"+3,1","+3,1","[Xe] 6s2 4f14 5d9","[Xe] 6s2 4f14 5d9",1.79,0.85,1.34,null,null,144,151,null,99,10.2,"cubic: face centered","7440-57-5",0.452,0.128,12.55,334.4,317,0.004,0.004,1e-05,null,"Gold, gold bearing rock (misc)","golden yellow","Inert, ductile malleable","fcc: face-centered cubic",2.75,"jewelry, electronics","none","none","none","none","none","none","Au2O3","AuCl AuCl3",6.1,366,null,{"v":-0.728158393463501,"d":"-0.728"},-2.4,4400,1200,null,"no"]
[80,"Hg",12,"II B",6,"mercury","Quecksilber","mercure","mercurio","mercurio","201",200.59,-38.9,357,"liquid",13.5,2,10.4375,18.759,34.202,1007,1810,3300,"<0","<0","+2,1","+2,1",{"$f":"CONCATENATE(\"[\",B$59,\"] \",E85,\"s\",MIN(A85-A$59,2),\" \",E85-2,\"f\",MIN(A85-A$61,14),\" \",E85-1,\"d\",MIN(A85-A$75,10))","v":"[Xe] 6s2 4f14 5d10"},"[Xe] 6s2 4f14 5d10",1.76,1.02,1.49,null,null,151,133,116,null,14.82,"rhombohedral","7439-97-6",0.0104,0.139,2.295,59.229,8.34,0.085,3e-05,null,null,"Cinnabar (sulfide)","silvery-white","liquid at r.t., volatile","rhombohedral",null,"amalgams, Cl2, NaOH prod.","none, w/ht (350C) =>HgO","none","none","mild, =>NOx, Hg(NO3)2","none","none","HgO","Hg2Cl2 HgCl2",5.4,61,null,{"v":-0.46852108295774475,"d":"-0.469"},-1.1,5,0.51,"yes","no"]
[81,"Tl",13,"III A",6,"thallium","Thallium","thallium","talio","tallio","204",204.3833,303,1457,"solid",11.9,1.62,6.1083,20.428,29.829,589,1971,2878,{"v":0.2,"d":"0.20"},19,"+1,3","+1,3",{"$f":"CONCATENATE(\"[\",B$59,\"] \",E86,\"s\",MIN(A86-A$59,2),\" \",E86-2,\"f\",MIN(A86-A$61,14),\" \",E86-1,\"d\",MIN(A86-A$75,10),\" \",E86,\"p\",MIN(A86-A$85,6))","v":"[Xe] 6s2 4f14 5d10 6p1"},"[Xe] 6s2 4f14 5d10 6p1",2.08,1.59,1.48,null,null,170,164,null,102.5,17.2,"hexagonal","7440-28-0",0.0617,0.13,4.142,164.1,46.1,0.85,1.9e-05,null,null,"Zn/Pb smelting by-product","bluish-gray","soft","hcp: hexagonal close pkd",1.2,"IR detectors, photomult.","mild, =>Tl2O","mild, =>TlOH",null,"mild, =>TlNO3",null,null,"Tl2O Tl2O3","TlCl TlCl3",7.6,182,1861,{"v":-0.7351821769904634,"d":"-0.735"},-0.3,48,null,null,"no"]
[82,"Pb",14,"IV A",6,"lead","Blei","plomb","plomo","piombo","207",207.2,327.5,1740,"solid",11.4,2.33,7.4167,15.028,31.943,716,1450,3082,0.36,35,"+2,4","+2,4","[Xe] 6s2 4f14 5d10 6p2","[Xe] 6s2 4f14 5d10 6p2",1.81,1.19,1.47,null,null,146,null,133,null,18.17,"cubic: face centered","7439-92-1",0.0481,0.13,4.799,177.7,35.3,0.14,3e-05,0.00017,null,"Galena (sulfide)","gray","soft","fcc: face-centered cubic",1.5,"batteries, solder, paints","mild, w/ht, =>PbO","none","none","mild, =>NOx, Pb(NO3)2",null,"PbH4","PbO Pb3O4 Pb2O3 PbO2","PbCl2 PbCl4",6.8,196,null,{"v":0.4983105537896005,"d":"0.498"},1.1,1.5,0.077,null,"no"]
[83,"Bi",15,"V A",6,"bismuth","Wismut","bismuth","bismuto","bismuto","209",208.9804,271,1560,"solid",9.75,2.02,7.289,16.687,25.559,703,1610,2466,0.95,92,"+3,5","+3,5","[Xe] 6s2 4f14 5d10 6p3","[Xe] 6s2 4f14 5d10 6p3",1.63,1.03,1.46,null,null,150,null,null,117,21.3,"rhombohedral","7440-69-9",0.00867,0.12,11.3,104.8,7.87,0.0085,2e-05,null,null,"Pb smelting by-product","white","brittle","rhombohedral",2.5,"antacid, fusible alloy","mild, w/ht =>Bi2O3","none","none","mild, =>Bi(NO3)3, NOx",null,"BiH3","Bi2O3","BiCl3 BiCl4",7.4,207,1600,{"v":-0.8416375079047503,"d":"-0.842"},-0.8,11]
[84,"Po",16,"VI A",6,"polonium","Polonium","polonium","polonio","polonio",{"$f":"TEXT(ROUND(L89,1),\"0\")","v":"209"},209,254,962,"solid",9.32,2,8.4167,null,null,812,"","",{"v":1.9,"d":"1.90"},183,"+4,2","+4,2","[Xe] 6s2 4f14 5d10 6p4","[Xe] 6s2 4f14 5d10 6p4",1.53,"",1.46,null,null,168,{"$nulls":3},22.23,"monoclinic","7440-08-6",0.0219,0.12,"","",20,2e-10,1.4E-14,null,null,"pitchblende, synthetic","blue glow","Radioactive; 2 forms","special: simple cubic",null,"thermoelectric power","mild, =>PoO2","none","mild, =>PoCl2",{"$nulls":3},"PoO PoO2","PoCl2 PoCl4",6.8,144,1898,null,-9.7]
[85,"At",17,"VII A",6,"astatine","Astat","astate","astato","astato","210",210,302,337,"solid",null,2.2,9.5,null,null,917,"","",{"v":2.8,"d":"2.80"},270,"","","[Xe] 6s2 4f14 5d10 6p5","[Xe] 6s2 4f14 5d10 6p5",1.43,"",1.45,{"$nulls":6},"","","7440-68-8","","","","",1.7,{"$nulls":4},"Synthetic(Th or U decay)",null,"Radioactive",{"$nulls":8},"HAt",null,null,6,92,1940]
[86,"Rn",18,"VIII A",6,"radon","Radon","radon","radón","radon","222",222,-71,-61.8,"gaseous",0.00973,null,10.7485,null,null,1037,"","","<0","<0","0",null,"[Xe] 6s2 4f14 5d10 6p6","[Xe] 6s2 4f14 5d10 6p6",1.34,"","",{"$nulls":6},50.5,"cubic: face centered","10043-92-2","",0.09,2.89,16.4,3.64E-3,4e-13,6e-16,null,null,"Synthetic(Ra-226 decay)","colorless","Radioactive,air pollutant",null,null,"earthquake prediction","none","none","none","none","none",{"$nulls":3},5.3,0,1900,null,-12.4]
[87,"Fr",1,"I A",7,"francium","Franzium","francium","francio","francio","223",223,27,677,"solid",null,0.7,3.94,null,null,380,"","",0.46,44,"+1","+1",{"$f":"CONCATENATE(\"[\",B$91,\"] \",E92,\"s\",MIN(A92-A$91,2))","v":"[Rn] 7s1"},"[Rn] 7s1","","","",{"$nulls":3},194,null,null,"","cubic: body centered","7440-73-5",0.03,"","","",15,{"$nulls":4},"Synthetic(U-235 decay)",null,"Radioactive",{"$nulls":4},"vigorous, =>H2, FrOH","vigorous, =>H2, FrCl",null,"vigorous, =>H2, FrOH",{"$nulls":3},48.7,73,1939]
[88,"Ra",2,"II A",7,"radium","Radium","radium","radio","radio","226",226,700,1140,"solid",5,0.9,5.2789,10.148,null,509,979,"",null,"","+2","+2",{"$f":"CONCATENATE(\"[\",B$91,\"] \",E93,\"s\",MIN(A93-A$91,2))","v":"[Rn] 7s2"},"[Rn] 7s2","",1.62,"",{"$nulls":4},162,null,45.2,"cubic: body centered","7440-14-4","",0.12,"","",18.6,9e-07,8.9e-11,null,null,"pitchblende(U-238 decay)","white","Radioactive, luminescent","bcc: body-centered cubic",null,"neutron source","vigorous, =>RaO2, Ra3N2",{"$nulls":6},"RaCl2",38.3,159,1898,null,-6]
[89,"Ac","actinides","III B",7,"actinium","Aktinium","actinium","actinio","attinio","227",227,1050,3200,"solid",10.1,1.1,5.17,12.126,null,499,1170,"",null,"","+3","+3",{"$f":"CONCATENATE(\"[\",B$91,\"] \",E94,\"s\",MIN(A94-A$91,2),\" \",E94-2,\"f\",MIN(A94-A$93,14))","v":"[Rn] 7s2 5f1"},"[Rn] 7s2 5f1","","","",{"$nulls":5},126,22.54,"cubic: face centered","7440-34-8","","","","",12,5.5e-10,{"$nulls":3},"Synthetic(U-235 decay)","silvery-white","Radioactive","fcc: face-centered cubic",null,"thermoelectric power","mild, w/ht, =>Ac2O3","mild, =>H2, Ac(OH)3","mild, =>H2, AcCl3","mild, =>Ac(NO3)3",null,"AcH2","Ac2O3","AcCl3",32.1,385,1899,null,-9.3]
[90,"Th","actinides","actinides",7,"thorium","Thorium","thorium","torio","torio",{"$f":"TEXT(ROUND(L95,1),\"0.0\")","v":"232"},232.03806,1750,4790,"solid",11.7,1.3,6.08,11.504,20.003,587,1110,1930,null,"","+4","+4","[Rn] 7s2 5f2","[Rn] 7s2 5f2","",1.05,1.65,null,null,179,{"$nulls":3},19.9,"cubic: face centered","7440-29-1",0.0653,0.12,16.1,514.4,54,9.6,1e-06,null,null,"Monazite(phosphate),U extractn","white","Radioactive","fcc: face-centered cubic",null,"gas mantles (ThO2)","mild, w/ht ignites =>ThO2","none","mild","passivated","none","ThH2 Th4H15","ThO2","ThCl4",32.1,576,1829,{"v":-1.4749551929631546,"d":"-1.475"},1]
[91,"Pa","actinides","actinides",7,"protactinium","Protaktinium","protactinium","protactinio","protoattinio",{"$f":"TEXT(ROUND(L96,1),\"0.0\")","v":"231"},231.03588,1570,4000,"solid",15.4,1.5,5.89,null,null,568,"","",null,"","+5,4","+5,4","[Rn] 7s2 5f3","[Rn] 7s2 5f3","","","",null,null,163,null,null,118,15,"orthorhombic","7440-13-3",0.0529,0.12,12.3,"",47,1.4e-06,5e-11,null,null,"Synthetic(U-235 decay)","silvery","Radioactive","fcc: face-centered cubic",{"$nulls":3},"none",null,null,"none","PaH3","PaO PaO2 Pa2O5","PaCl4 PaCl5",25.4,527,1917,null,-5.9]
[92,"U","actinides","actinides",7,"uranium","Uran","uranium","uranio","uranio",{"$f":"TEXT(ROUND(L97,1),\"0.0\")","v":"238"},238.02891,1132,3818,"solid",19,1.38,6.1941,null,null,598,"","",null,"","+6,3,4,5","+6,3,4,5","[Rn] 7s2 5f4","[Rn] 7s2 5f4","",0.81,1.42,null,null,156,null,null,116.5,12.59,"orthorhombic","7440-61-1",0.038,0.12,8.52,477,27.6,2.7,0.0032,1e-07,null,"Uranite (oxide)","silvery","Radioactive","hcp:hex cls pkd distorted",null,"nuclear reactor fuel","mild, =>U3O8","mild (powder)","mild, =>H2","passivated","none","UH3","UO UO2 U2O5 U3O8 UO3","UCl3 UCl4 UCl5 UCl6",27.4,490,1789,{"v":-2.045757490560675,"d":"-2.046"},0.4,{"$nulls":3},"no"]
[93,"Np","actinides","actinides",7,"neptunium","Neptunium","neptunium","neptunio","nettunio",{"$f":"TEXT(ROUND(L98,1),\"0\")","v":"237"},237,640,3900,"solid",20.2,1.36,6.2657,null,null,605,"","",null,"","+5,3,4,6","+5,3,4,6","[Rn] 7s2 5f5","[Rn] 7s2 5f5","","","",null,null,155,null,124,115,11.62,"orthorhombic","7439-99-8",0.00822,0.12,5.19,"",6.3,{"$nulls":4},"Synthetic","silvery","Radioactive","special:complex",{"$nulls":7},"NpH2 NpH3","NpO NpO2 Np2O5","NpCl3 NpCl4",24.8,null,1940]
[94,"Pu","actinides","actinides",7,"plutonium","Plutonium","plutonium","plutonio","plutonio","239",239,641,3232,"solid",19.8,1.28,6.06,null,null,585,"","",null,"","+4,3,5,6","+4,3,5,6","[Rn] 7s2 5f6","[Rn] 7s2 5f6","","","",null,null,159,null,null,114,12.32,"monoclinic","7440-07-5",0.00666,0.13,2.84,344,6.74,{"$nulls":4},"Synthetic","silvery","Radioactive","fcc: face-centered cubic",null,"weapon fuel, pacemakers",{"$nulls":3},"passivated",null,"PuH2 PuH3","PuO Pu2O3 PuO2","PuCl2 PuCl3",24.5,352,1940]
[95,"Am","actinides","actinides",7,"americium","Amerizium","américium","americio","americio","243",243,994,2607,"solid",13.7,1.3,5.9933,null,null,578,"","",null,"","+3,4,5,6","+3,4,5,6","[Rn] 7s2 5f7","[Rn] 7s2 5f7","","","",null,null,173,null,null,111.5,17.86,"hexagonal","7440-35-9",0.022,0.11,14.4,"",10,{"$nulls":4},"Synthetic","silvery-white","Radioactive","fcc: face-centered cubic",null,"smoke detector",{"$nulls":5},"AmH2 AmH3","AmO Am2O3 AmO2","AmCl2 AmCl3",23.3,null,1944]
[96,"Cm","actinides","actinides",7,"curium","Kurium","curium","curio","curio","247",247,1340,null,"solid",13.5,1.3,6.02,null,null,581,"","",null,"","+3","+3","[Rn] 7s2 5f8","[Rn] 7s2 5f8","","","",null,null,174,null,null,111,18.28,"hexagonal","7440-51-9","","",15,"",10,{"$nulls":4},"Synthetic","silvery-white","Radioactive","fcc: face-centered cubic",null,"thermoelec. pwr, n source",{"$nulls":5},"CmH2","CmO Cm2O3 CmO2","CmCl3",23,null,1944]
[97,"Bk","actinides","actinides",7,"berkelium","Berkelium","berkélium","berkelio","berkelio","247",247,986,null,"solid",14,1.3,6.23,null,null,601,"","",null,"","+3,4","+3,4","[Rn] 7s2 5f9","[Rn] 7s2 5f9","","","",null,null,170,null,null,110,"","","7440-40-6","","","","",10,{"$nulls":4},"Synthetic","silvery","Radioactive","fcc: face-centered cubic",{"$nulls":8},"BkO Bk2O3 BkO2","BkCl3",22.7,null,1949]
[98,"Cf","actinides","actinides",7,"californium","Kalifornium","californium","californio","californio","251",251,{"$nulls":4},1.3,6.3,null,null,608,"","",null,"","+3","+3","[Rn] 7s2 5f10","[Rn] 7s2 5f10","","","",null,null,186,null,null,109,"","","7440-71-3","","","","",10,{"$nulls":4},"Synthetic",null,"Radioactive",null,null,"neutron source",{"$nulls":6},"CfO Cf2O3 CfO2","CfCl3",20.5,null,1949]
[99,"Es","actinides","actinides",7,"einsteinium","Einsteinium","einsteinium","einstenio","einstenio","252",252,{"$nulls":4},1.3,6.42,null,null,619,"","",null,"","+3","+3","[Rn] 7s2 5f11","[Rn] 7s2 5f11","","","",null,null,186,{"$nulls":3},"","","7429-92-7","","","","",10,{"$nulls":4},"Synthetic",null,"Radioactive",{"$nulls":9},"Es2O3",null,19.7,null,1954]
[100,"Fm","actinides","actinides",7,"fermium","Fermium","fermium","fermio","fermio","257",257,{"$nulls":4},1.3,6.5,null,null,627,"","",null,"","+3","+3","[Rn] 7s2 5f12","[Rn] 7s2 5f12","","","",{"$nulls":6},"","","7440-72-4","","","","",10,{"$nulls":4},"Synthetic",null,"Radioactive",{"$nulls":11},23.8,null,1954]
[101,"Md","actinides","actinides",7,"mendelevium","Mendelevium","mendélévium","mendelevio","mendelevio","258",258,{"$nulls":4},1.3,6.58,null,null,635,"","",null,"","+3,2","+3,2","[Rn] 7s2 5f13","[Rn] 7s2 5f13","","","",{"$nulls":6},"","","7440-11-1","","","","",10,{"$nulls":4},"Synthetic",null,"Radioactive",{"$nulls":11},18.2,null,1955]
[102,"No","actinides","actinides",7,"nobelium","Nobelium","nobélium","nobelio","nobelio","259",259,{"$nulls":4},1.3,6.65,null,null,642,"","",null,"","+2,3","+2,3",{"$f":"CONCATENATE(\"[\",B$91,\"] \",E107,\"s\",MIN(A107-A$91,2),\" \",E107-2,\"f\",MIN(A107-A$93,14))","v":"[Rn] 7s2 5f14"},"[Rn] 7s2 5f14","","","",{"$nulls":4},124,null,"","","10028-14-5","","","","",10,{"$nulls":4},"Synthetic",null,"Radioactive",{"$nulls":11},17.5,null,1958]
[103,"Lr",3,"actinides",7,"lawrencium","Lawrencium","lawrencium","lawrencio","laurenzio","262",262,{"$nulls":8},"","","",null,"","+3","+3",{"$f":"CONCATENATE(\"[\",B$91,\"] \",E108,\"s\",MIN(A108-A$91,2),\" \",E108-2,\"f\",MIN(A108-A$93,14),\" \",E108-1,\"d\",MIN(A108-A$107,10))","v":"[Rn] 7s2 5f14 6d1"},"[Rn] 7s2 5f14 6d1","","","",{"$nulls":6},"","","22537-19-5","","","","",10,{"$nulls":4},"Synthetic",null,"Radioactive,few atms made",{"$nulls":13},1961]
[104,"Rf",4,"IV B",7,"rutherfordium","Rutherfordium","rutherfordium","ruterfordio","rutherfordio","261",261,{"$nulls":8},"","","",null,"","","","[Rn] 7s2 5f14 6d2","[Rn] 7s2 5f14 6d2","","","",{"$nulls":6},"","","53850-36-5","","","","",23]
[105,"Db",5,"V B",7,"dubnium","Dubnium","dubnium","dubnio","dubnio","262",262,{"$nulls":8},"","","",null,"","","","[Rn] 7s2 5f14 6d3","[Rn] 7s2 5f14 6d3","","","",{"$nulls":6},"","","53850-35-4","","","","",58]
[106,"Sg",6,"VI B",7,"seaborgium","Seaborgium","seaborgium","seaborgio","seaborgio","266",266,{"$nulls":8},"","","",null,"","","","[Rn] 7s2 5f14 6d4","[Rn] 7s2 5f14 6d4","","","",{"$nulls":6},"","","54038-81-2","","","","",""]
[107,"Bh",7,"VII B",7,"bohrium","Bohrium","bohrium","bohrio","bohrio","264",264,{"$nulls":8},"","","",null,"","","","[Rn] 7s2 5f14 6d5","[Rn] 7s2 5f14 6d5","","","",{"$nulls":6},"","","54037-14-8","","","","",""]
[108,"Hs",8,"VIII B",7,"hassium","Hassium","hassium","hassio","hassio","277",277,{"$nulls":8},"","","",null,"","","","[Rn] 7s2 5f14 6d6","[Rn] 7s2 5f14 6d6","","","",{"$nulls":6},"","","54037-57-9","","","","",""]
[109,"Mt",9,"VIII B",7,"meitnerium","Meitnerium ","meitnérium","meitnerio","meitnerio","268",268,{"$nulls":8},"","","",null,"","","","[Rn] 7s2 5f14 6d7","[Rn] 7s2 5f14 6d7","","","",{"$nulls":6},"","","54038-01-6","","","","",""]
[110,"Ds",10,"VIII B",7,"darmstadtium","Darmstadtium","darmstadtium","darmstadtio","darmstadtio","281",281,{"$nulls":8},"","","",null,"","","","[Rn] 7s2 5f14 6d8","[Rn] 7s2 5f14 6d8","","","",{"$nulls":6},"","","54083-77-1","","","","",""]
[111,"Rg",11,"I B",7,"roentgentium","Roentgentium","roentgentium","roentgentio","roentgentio","272",272,{"$nulls":8},"","","",null,"","","","[Rn] 7s2 5f14 6d9","[Rn] 7s2 5f14 6d9","","","",{"$nulls":6},"","","54386-24-2","","","","",""]
[112,"Cn",12,"II B",7,"copernicum","Kopernikum","copérnicum","copernico","copernico","285",285,{"$nulls":8},"","","",null,"","","",{"$f":"CONCATENATE(\"[\",B$91,\"] \",E117,\"s\",MIN(A117-A$91,2),\" \",E117-2,\"f\",MIN(A117-A$93,14),\" \",E117-1,\"d\",MIN(A117-A$107,10))","v":"[Rn] 7s2 5f14 6d10"},"[Rn] 7s2 5f14 6d10","","","",{"$nulls":6},"","","54084-26-3","","","","",""]
[113,"Uut",13,"III A",7,"ununtrium","Ununtrium","ununtrium","ununtrio","ununtrio","284",284,{"$nulls":8},"","","",null,"","","",{"$f":"CONCATENATE(\"[\",B$91,\"] \",E118,\"s\",MIN(A118-A$91,2),\" \",E118-2,\"f\",MIN(A118-A$93,14),\" \",E118-1,\"d\",MIN(A118-A$107,10),\" \",E118,\"p\",MIN(A118-A$117,6))","v":"[Rn] 7s2 5f14 6d10 7p1"},"[Rn] 7s2 5f14 6d10 7p1",{"$nulls":11},"54084-70-7"]
[114,"Uuq",14,"IV A",7,"ununquadium","Ununquadium","ununquadium","ununquadio","ununquadio","289",289,{"$nulls":8},"","","",null,"","","","[Rn] 7s2 5f14 6d10 7p2","[Rn] 7s2 5f14 6d10 7p2","","","",{"$nulls":6},"","","54085-16-4","","","","",""]
[115,"Uup",15,"V A",7,"ununpentium","Ununpentium","ununpentium","ununpentio","ununpentio","288",288,{"$nulls":8},"","","",null,"","","","[Rn] 7s2 5f14 6d10 7p3","[Rn] 7s2 5f14 6d10 7p3",{"$nulls":11},"54085-64-2"]
[116,"Uuh",16,"VI A",7,"ununhexium","Ununhexium","ununhexium","ununhexio","ununhexio","292",292,{"$nulls":8},"","","",null,"","","","[Rn] 7s2 5f14 6d10 7p4","[Rn] 7s2 5f14 6d10 7p4","","","",{"$nulls":6},"","","54100-71-9","","","","",""]
[117,"Uus",17,"VII A",7,"ununseptium","Ununseptium","ununseptium","ununseptio","ununseptio","293",293,{"$nulls":28},"87658-56-8"]
[118,"Uuo",18,"VIII A",7,"ununoctium","Ununoctium","ununoctium","ununoctio","ununoctio","294",294,{"$nulls":8},"","","",null,"",null,null,"[Rn] 7s2 5f14 6d10 7p6","[Rn] 7s2 5f14 6d10 7p6","","","",{"$nulls":6},"","","54144-19-3","","","","",""]
[]
[]
[]
[]
[{"$nulls":9},{"$f":"J129","v":90},"Density","Density","Melt","Boil","State","color",{"$nulls":23},"year",{"$nulls":6},"am",{"$nulls":3},"source",{"$nulls":3},"use"]
[{"$nulls":9},{"$f":"zAdjusted","v":90},{"$error":"#N/A"},{"$f":"IF(LOOKUP($J$128,Sheet2!$A$6:$A$123,Sheet2!$P$6:$P$123)=\"\",\"-\",LOOKUP($J$128,Sheet2!$A$6:$A$123,Sheet2!$P$6:$P$123))","v":11.7},{"$f":"IF(LOOKUP($J$128,Sheet2!$A$6:$A$123,Sheet2!$M$6:$M$123)=\"\",\"-\",LOOKUP($J$128,Sheet2!$A$6:$A$123,Sheet2!$M$6:$M$123))","v":1750},{"$f":"IF(LOOKUP($J$128,Sheet2!$A$6:$A$123,Sheet2!$N$6:$N$123)=\"\",\"-\",LOOKUP($J$128,Sheet2!$A$6:$A$123,Sheet2!$N$6:$N$123))","v":4790},{"$f":"IF(LOOKUP($J$128,Sheet2!$A$6:$A$123,Sheet2!$O$6:$O$123)=\"\",\"-\",LOOKUP($J$128,Sheet2!$A$6:$A$123,Sheet2!$O$6:$O$123))","v":"solid"},{"$f":"IF(LOOKUP($J$128,Sheet2!$A$6:$A$123,Sheet2!$AZ$6:$AZ$123)=\"\",\"-\",LOOKUP($J$128,Sheet2!$A$6:$A$123,Sheet2!$AZ$6:$AZ$123))","v":"white"},{"$f":"IF(LOOKUP($J$128,Sheet2!$A$6:$A$123,Sheet2!$P$6:$P$123)=\"\",\"-\",LOOKUP($J$128,Sheet2!$A$6:$A$123,Sheet2!$P$6:$P$123))","v":11.7},{"$f":"IF(LOOKUP($J$128,Sheet2!$A$6:$A$123,Sheet2!$P$6:$P$123)=\"\",\"-\",LOOKUP($J$128,Sheet2!$A$6:$A$123,Sheet2!$P$6:$P$123))","v":11.7},{"$f":"IF(LOOKUP($J$128,Sheet2!$A$6:$A$123,Sheet2!$P$6:$P$123)=\"\",\"-\",LOOKUP($J$128,Sheet2!$A$6:$A$123,Sheet2!$P$6:$P$123))","v":11.7},{"$f":"IF(LOOKUP($J$128,Sheet2!$A$6:$A$123,Sheet2!$P$6:$P$123)=\"\",\"-\",LOOKUP($J$128,Sheet2!$A$6:$A$123,Sheet2!$P$6:$P$123))","v":11.7},{"$f":"IF(LOOKUP($J$128,Sheet2!$A$6:$A$123,Sheet2!$P$6:$P$123)=\"\",\"-\",LOOKUP($J$128,Sheet2!$A$6:$A$123,Sheet2!$P$6:$P$123))","v":11.7},{"$f":"IF(LOOKUP($J$128,Sheet2!$A$6:$A$123,Sheet2!$P$6:$P$123)=\"\",\"-\",LOOKUP($J$128,Sheet2!$A$6:$A$123,Sheet2!$P$6:$P$123))","v":11.7},{"$f":"IF(LOOKUP($J$128,Sheet2!$A$6:$A$123,Sheet2!$P$6:$P$123)=\"\",\"-\",LOOKUP($J$128,Sheet2!$A$6:$A$123,Sheet2!$P$6:$P$123))","v":11.7},{"$f":"IF(LOOKUP($J$128,Sheet2!$A$6:$A$123,Sheet2!$P$6:$P$123)=\"\",\"-\",LOOKUP($J$128,Sheet2!$A$6:$A$123,Sheet2!$P$6:$P$123))","v":11.7},{"$f":"IF(LOOKUP($J$128,Sheet2!$A$6:$A$123,Sheet2!$P$6:$P$123)=\"\",\"-\",LOOKUP($J$128,Sheet2!$A$6:$A$123,Sheet2!$P$6:$P$123))","v":11.7},{"$f":"IF(LOOKUP($J$128,Sheet2!$A$6:$A$123,Sheet2!$P$6:$P$123)=\"\",\"-\",LOOKUP($J$128,Sheet2!$A$6:$A$123,Sheet2!$P$6:$P$123))","v":11.7},{"$f":"IF(LOOKUP($J$128,Sheet2!$A$6:$A$123,Sheet2!$P$6:$P$123)=\"\",\"-\",LOOKUP($J$128,Sheet2!$A$6:$A$123,Sheet2!$P$6:$P$123))","v":11.7},{"$f":"IF(LOOKUP($J$128,Sheet2!$A$6:$A$123,Sheet2!$P$6:$P$123)=\"\",\"-\",LOOKUP($J$128,Sheet2!$A$6:$A$123,Sheet2!$P$6:$P$123))","v":11.7},{"$f":"IF(LOOKUP($J$128,Sheet2!$A$6:$A$123,Sheet2!$P$6:$P$123)=\"\",\"-\",LOOKUP($J$128,Sheet2!$A$6:$A$123,Sheet2!$P$6:$P$123))","v":11.7},{"$f":"IF(LOOKUP($J$128,Sheet2!$A$6:$A$123,Sheet2!$P$6:$P$123)=\"\",\"-\",LOOKUP($J$128,Sheet2!$A$6:$A$123,Sheet2!$P$6:$P$123))","v":11.7},{"$f":"IF(LOOKUP($J$128,Sheet2!$A$6:$A$123,Sheet2!$P$6:$P$123)=\"\",\"-\",LOOKUP($J$128,Sheet2!$A$6:$A$123,Sheet2!$P$6:$P$123))","v":11.7},{"$f":"IF(LOOKUP($J$128,Sheet2!$A$6:$A$123,Sheet2!$P$6:$P$123)=\"\",\"-\",LOOKUP($J$128,Sheet2!$A$6:$A$123,Sheet2!$P$6:$P$123))","v":11.7},{"$f":"IF(LOOKUP($J$128,Sheet2!$A$6:$A$123,Sheet2!$P$6:$P$123)=\"\",\"-\",LOOKUP($J$128,Sheet2!$A$6:$A$123,Sheet2!$P$6:$P$123))","v":11.7},{"$f":"IF(LOOKUP($J$128,Sheet2!$A$6:$A$123,Sheet2!$P$6:$P$123)=\"\",\"-\",LOOKUP($J$128,Sheet2!$A$6:$A$123,Sheet2!$P$6:$P$123))","v":11.7},{"$f":"IF(LOOKUP($J$128,Sheet2!$A$6:$A$123,Sheet2!$P$6:$P$123)=\"\",\"-\",LOOKUP($J$128,Sheet2!$A$6:$A$123,Sheet2!$P$6:$P$123))","v":11.7},{"$f":"IF(LOOKUP($J$128,Sheet2!$A$6:$A$123,Sheet2!$P$6:$P$123)=\"\",\"-\",LOOKUP($J$128,Sheet2!$A$6:$A$123,Sheet2!$P$6:$P$123))","v":11.7},{"$f":"IF(LOOKUP($J$128,Sheet2!$A$6:$A$123,Sheet2!$P$6:$P$123)=\"\",\"-\",LOOKUP($J$128,Sheet2!$A$6:$A$123,Sheet2!$P$6:$P$123))","v":11.7},{"$f":"IF(LOOKUP($J$128,Sheet2!$A$6:$A$123,Sheet2!$P$6:$P$123)=\"\",\"-\",LOOKUP($J$128,Sheet2!$A$6:$A$123,Sheet2!$P$6:$P$123))","v":11.7},{"$f":"IF(LOOKUP($J$128,Sheet2!$A$6:$A$123,Sheet2!$P$6:$P$123)=\"\",\"-\",LOOKUP($J$128,Sheet2!$A$6:$A$123,Sheet2!$P$6:$P$123))","v":11.7},{"$f":"IF(LOOKUP($J$128,Sheet2!$A$6:$A$123,Sheet2!$BO$6:$BO$123)=\"\",\"-\",LOOKUP($J$128,Sheet2!$A$6:$A$123,Sheet2!$BO$6:$BO$123))","v":1829},{"$f":"IF(LOOKUP($J$128,Sheet2!$A$6:$A$123,Sheet2!$P$6:$P$123)=\"\",\"-\",LOOKUP($J$128,Sheet2!$A$6:$A$123,Sheet2!$P$6:$P$123))","v":11.7},{"$f":"IF(LOOKUP($J$128,Sheet2!$A$6:$A$123,Sheet2!$P$6:$P$123)=\"\",\"-\",LOOKUP($J$128,Sheet2!$A$6:$A$123,Sheet2!$P$6:$P$123))","v":11.7},{"$f":"IF(LOOKUP($J$128,Sheet2!$A$6:$A$123,Sheet2!$P$6:$P$123)=\"\",\"-\",LOOKUP($J$128,Sheet2!$A$6:$A$123,Sheet2!$P$6:$P$123))","v":11.7},{"$f":"IF(LOOKUP($J$128,Sheet2!$A$6:$A$123,Sheet2!$P$6:$P$123)=\"\",\"-\",LOOKUP($J$128,Sheet2!$A$6:$A$123,Sheet2!$P$6:$P$123))","v":11.7},{"$f":"IF(LOOKUP($J$128,Sheet2!$A$6:$A$123,Sheet2!$P$6:$P$123)=\"\",\"-\",LOOKUP($J$128,Sheet2!$A$6:$A$123,Sheet2!$P$6:$P$123))","v":11.7},{"$f":"IF(LOOKUP($J$128,Sheet2!$A$6:$A$123,Sheet2!$P$6:$P$123)=\"\",\"-\",LOOKUP($J$128,Sheet2!$A$6:$A$123,Sheet2!$P$6:$P$123))","v":11.7},{"$f":"IF(LOOKUP($J$128,Sheet2!$A$6:$A$123,Sheet2!$L$6:$L$123)=\"\",\"-\",LOOKUP($J$128,Sheet2!$A$6:$A$123,Sheet2!$L$6:$L$123))","v":{"v":232.03806,"d":"232.0"}},{"$f":"IF(LOOKUP($J$128,Sheet2!$A$6:$A$123,Sheet2!$P$6:$P$123)=\"\",\"-\",LOOKUP($J$128,Sheet2!$A$6:$A$123,Sheet2!$P$6:$P$123))","v":11.7},{"$f":"IF(LOOKUP($J$128,Sheet2!$A$6:$A$123,Sheet2!$P$6:$P$123)=\"\",\"-\",LOOKUP($J$128,Sheet2!$A$6:$A$123,Sheet2!$P$6:$P$123))","v":11.7},{"$f":"IF(LOOKUP($J$128,Sheet2!$A$6:$A$123,Sheet2!$P$6:$P$123)=\"\",\"-\",LOOKUP($J$128,Sheet2!$A$6:$A$123,Sheet2!$P$6:$P$123))","v":11.7},{"$f":"IF(LOOKUP($J$128,Sheet2!$A$6:$A$123,Sheet2!$AY$6:$AY$123)=\"\",\"-\",LOOKUP($J$128,Sheet2!$A$6:$A$123,Sheet2!$AY$6:$AY$123))","v":"Monazite(phosphate),U extractn"},{"$f":"IF(LOOKUP($J$128,Sheet2!$A$6:$A$123,Sheet2!$BD$6:$BD$123)=\"\",\"-\",LOOKUP($J$128,Sheet2!$A$6:$A$123,Sheet2!$BD$6:$BD$123))","v":"gas mantles (ThO2)"},{"$f":"LOOKUP($J$128,Sheet2!$A$6:$A$123,Sheet2!$AY$6:$AY$123)","v":"Monazite(phosphate),U extractn"},{"$f":"LOOKUP($J$128,Sheet2!$A$6:$A$123,Sheet2!$AY$6:$AY$123)","v":"Monazite(phosphate),U extractn"},{"$f":"LOOKUP($J$128,Sheet2!$A$6:$A$123,Sheet2!$BD$6:$BD$123)","v":"gas mantles (ThO2)"}]
[{"$nulls":12},{"$f":"LOOKUP($J$128,$A$6:$A$123,Sheet2!$M$6:$M$13)","v":1750},{"$f":"LOOKUP($J$128,Sheet2!$A$6:$A$123,Sheet2!$N$6:$N$123)","v":4790},{"$f":"LOOKUP($J$128,Sheet2!$A$6:$A$123,Sheet2!$O$6:$O$123)","v":"solid"},{"$f":"LOOKUP($J$128,Sheet2!$A$6:$A$123,Sheet2!$AZ$6:$AZ$123)","v":"white"},{"$error":"#N/A"},{"$error":"#N/A"},{"$error":"#N/A"},{"$error":"#N/A"},{"$error":"#N/A"},{"$error":"#N/A"},{"$error":"#N/A"},{"$error":"#N/A"},{"$error":"#N/A"},{"$error":"#N/A"},{"$error":"#N/A"},{"$error":"#N/A"},{"$error":"#N/A"},{"$error":"#N/A"},{"$error":"#N/A"},{"$error":"#N/A"},{"$error":"#N/A"},{"$error":"#N/A"},{"$error":"#N/A"},{"$error":"#N/A"},{"$error":"#N/A"},{"$error":"#N/A"},{"$error":"#N/A"},{"$f":"LOOKUP($J$128,Sheet2!$A$6:$A$123,Sheet2!$BO$6:$BO$123)","v":1829},{"$f":"LOOKUP($J$128,Sheet2!$A$6:$A$123,Sheet2!$BO$6:$BO$123)","v":1829},{"$f":"LOOKUP($J$128,Sheet2!$A$6:$A$123,Sheet2!$BO$6:$BO$123)","v":1829},{"$f":"LOOKUP($J$128,Sheet2!$A$6:$A$123,Sheet2!$BO$6:$BO$123)","v":1829},{"$f":"LOOKUP($J$128,Sheet2!$A$6:$A$123,Sheet2!$BO$6:$BO$123)","v":1829},{"$f":"LOOKUP($J$128,Sheet2!$A$6:$A$123,Sheet2!$BO$6:$BO$123)","v":1829},{"$f":"LOOKUP($J$128,Sheet2!$A$6:$A$123,Sheet2!$BO$6:$BO$123)","v":1829},{"$f":"LOOKUP($J$128,Sheet2!$A$6:$A$123,Sheet2!$L$6:$L$123)","v":{"v":232.03806,"d":"232.0"}},{"$f":"LOOKUP($J$128,Sheet2!$A$6:$A$123,Sheet2!$AY$6:$AY$123)","v":"Monazite(phosphate),U extractn"},{"$f":"LOOKUP($J$128,Sheet2!$A$6:$A$123,Sheet2!$AY$6:$AY$123)","v":"Monazite(phosphate),U extractn"},{"$f":"LOOKUP($J$128,Sheet2!$A$6:$A$123,Sheet2!$AY$6:$AY$123)","v":"Monazite(phosphate),U extractn"},{"$f":"LOOKUP($J$128,Sheet2!$A$6:$A$123,Sheet2!$AY$6:$AY$123)","v":"Monazite(phosphate),U extractn"},{"$f":"LOOKUP($J$128,Sheet2!$A$6:$A$123,Sheet2!$BD$6:$BD$123)","v":"gas mantles (ThO2)"}]

{"sheet":"Data","index":3,"n_rows":120,"n_cols":20,"rows_kept":120,"hidden":true,"merged":[[0,0,1,0],[0,2,1,2],[0,3,1,3],[0,4,1,4]]}
["Z","Sym","Element","Group","Period","Weight","Density","Melt","Boil","Heat",null,"ClassNo"]
[{"$nulls":5},"u ()","g / cm3","K","K","J / g K","Classification"]
[1,"H","Hydrogen",1,1,"1.00794(7)",8.988E-5,14.175,20.28,14.304,"Nonmetals",8,null,{"$f":"H3-273.15","v":-258.97499999999997},{"$f":"I3-273.15","v":-252.86999999999998}]
[2,"He","Helium",18,1,"4.002602(2)",1.785E-4,0.956,4.22,5.193,"Noble Gases",10,null,{"$f":"H4-273.15","v":-272.19399999999996},{"$f":"I4-273.15","v":-268.92999999999995}]
[3,"Li","Lithium",1,2,"6.941(2)",0.534,453.85,1615,3.582,"Alkali Metals",1,null,180.70000000000005,1341.85]
[4,"Be","Beryllium",2,2,"9.012182(3)",1.85,1560.15,2742,1.825,"Alkaline Earth Metals",2,null,1287,2468.85]
[5,"B","Boron",13,2,"10.811(7)",2.34,2573.15,4200,1.026,"Metalloids",7,null,2300,3926.85]
[6,"C","Carbon",14,2,"12.0107(8)",2.267,"3915 (sublimates)","3915 (sublimates)",0.709,"Nonmetals",8,null,{"$error":"#VALUE!"},{"$error":"#VALUE!"}]
[7,"N","Nitrogen",15,2,"14.0067(2)",0.0012506,63.29,77.36,1.04,"Nonmetals",8,null,-209.85999999999999,-195.78999999999996]
[8,"O","Oxygen",16,2,"15.9994(3)",0.001429,50.5,90.2,0.918,"Nonmetals",8,null,-222.64999999999998,-182.95]
[9,"F","Fluorine",17,2,"18.9984032(5)",1.696E-3,53.63,85.03,0.824,"Halogens",9,null,-219.51999999999998,-188.11999999999998]
[10,"Ne","Neon",18,2,"20.1797(6)",0.0008999,24.703,27.07,1.03,"Noble Gases",10,null,-248.44699999999997,-246.07999999999998]
[11,"Na","Sodium",1,3,"22.98976928(2)",0.971,371.15,1156,1.228,"Alkali Metals",1,null,98,882.85]
[12,"Mg","Magnesium",2,3,"24.3050(6)",1.738,923.15,1363,1.023,"Alkaline Earth Metals",2,null,650,1089.85]
[13,"Al","Aluminium",13,3,"26.9815386(8)",2.698,933.4,2792,0.897,"Post-Transition Metals",6,null,660.25,2518.85]
[14,"Si","Silicon",14,3,"28.0855(3)",2.3296,1683.15,3538,0.705,"Metalloids",7,null,1410,3264.85]
[15,"P","Phosphorus",15,3,"30.973762(2)",1.82,317.25,553,0.769,"Nonmetals",8,null,44.10000000000002,279.85]
[16,"S","Sulfur",16,3,"32.065(5)",2.067,388.51,717.8,0.71,"Nonmetals",8,null,115.36000000000001,444.65]
[17,"Cl","Chlorine",17,3,"35.453(2)",0.003214,172.31,239.11,0.479,"Halogens",9,null,-100.83999999999997,-34.039999999999964]
[18,"Ar","Argon",18,3,"39.948(1)",1.7837E-3,83.96,87.3,0.52,"Noble Gases",10,null,-189.19,-185.84999999999997]
[19,"K","Potassium",1,4,"39.0983(1)",0.862,336.5,1032,0.757,"Alkali Metals",1,null,63.35000000000002,758.85]
[20,"Ca","Calcium",2,4,"40.078(4)",1.54,1112.15,1757,0.647,"Alkaline Earth Metals",2,null,839.0000000000001,1483.85]
[21,"Sc","Scandium",3,4,"44.955912(6)",2.989,1812.15,3109,0.568,"Transition Metals",5,null,1539,2835.85]
[22,"Ti","Titanium",4,4,"47.867(1)",4.54,1933.15,3560,0.523,"Transition Metals",5,null,1660,3286.85]
[23,"V","Vanadium",5,4,"50.9415(1)",6.11,2175.15,3680,0.489,"Transition Metals",5,null,1902,3406.85]
[24,"Cr","Chromium",6,4,"51.9961(6)",7.15,2130.15,2944,0.449,"Transition Metals",5,null,1857,2670.85]
[25,"Mn","Manganese",7,4,"54.938045(5)",7.44,1519.15,2334,0.479,"Transition Metals",5,null,1246,2060.85]
[26,"Fe","Iron",8,4,"55.845(2)",7.874,1808.15,3134,0.449,"Transition Metals",5,null,1535,2860.85]
[27,"Co","Cobalt",9,4,"58.933195(5)",8.86,1768.15,3200,0.421,"Transition Metals",5,null,1495,2926.85]
[28,"Ni","Nickel",10,4,"58.6934(4)",8.912,1726.15,3186,0.444,"Transition Metals",5,null,1453,2912.85]
[29,"Cu","Copper",11,4,"63.546(3)4",8.96,1357.75,2835,0.385,"Transition Metals",5,null,1084.6,2561.85]
[30,"Zn","Zinc",12,4,"65.38(2)",7.134,692.88,1180,0.388,"Transition Metals",5,null,419.73,906.85]
[31,"Ga","Gallium",13,4,"69.723(1)",5.907,302.91,2477,0.371,"Post-Transition Metals",6,null,29.760000000000048,2203.85]
[32,"Ge","Germanium",14,4,"72.63(1)",5.323,1211.45,3106,0.32,"Metalloids",7,null,938.3000000000001,2832.85]
[33,"As","Arsenic",15,4,"74.92160(2)",5.776,1090.157,887,0.329,"Metalloids",7,null,817.007,613.85]
[34,"Se","Selenium",16,4,"78.96(3)4",4.809,494.15,958,0.321,"Nonmetals",8,null,221,684.85]
[35,"Br","Bromine",17,4,"79.904(1)",3.122,266.05,332,0.474,"Halogens",9,null,-7.099999999999966,58.85000000000002]
[36,"Kr","Krypton",18,4,"83.798(2)",0.003733,115.93,119.93,0.248,"Noble Gases",10,null,-157.21999999999997,-153.21999999999997]
[37,"Rb","Rubidium",1,5,"85.4678(3)",1.532,312.79,961,0.363,"Alkali Metals",1,null,39.64000000000004,687.85]
[38,"Sr","Strontium",2,5,"87.62(1)",2.64,1042.15,1655,0.301,"Alkaline Earth Metals",2,null,769.0000000000001,1381.85]
[39,"Y","Yttrium",3,5,"88.90585(2)",4.469,1799.15,3609,0.298,"Transition Metals",5,null,1526,3335.85]
[40,"Zr","Zirconium",4,5,"91.224(2)",6.506,2125.15,4682,0.278,"Transition Metals",5,null,1852,4408.85]
[41,"Nb","Niobium",5,5,"92.90638(2)",8.57,2741.15,5017,0.265,"Transition Metals",5,null,2468,4743.85]
[42,"Mo","Molybdenum",6,5,"95.96(2)",10.22,2890.15,4912,0.251,"Transition Metals",5,null,2617,4638.85]
[43,"Tc","Technetium",7,5,"[98]",11.5,2473.15,5150,"–","Transition Metals",5,null,2200,4876.85]
[44,"Ru","Ruthenium",8,5,"101.07(2)",12.37,2523.15,4423,0.238,"Transition Metals",5,null,2250,4149.85]
[45,"Rh","Rhodium",9,5,"102.90550(2)",12.41,2239.15,3968,0.243,"Transition Metals",5,null,1966,3694.85]
[46,"Pd","Palladium",10,5,"106.42(1)",12.02,1825.15,3236,0.244,"Transition Metals",5,null,1552,2962.85]
[47,"Ag","Silver",11,5,"107.8682(2)",10.501,1234.15,2435,0.235,"Transition Metals",5,null,961.0000000000001,2161.85]
[48,"Cd","Cadmium",12,5,"112.411(8)",8.69,594.33,1040,0.232,"Transition Metals",5,null,321.18000000000006,766.85]
[49,"In","Indium",13,5,"114.818(3)",7.31,429.91,2345,0.233,"Post-Transition Metals",6,null,156.76000000000005,2071.85]
[50,"Sn","Tin",14,5,"118.710(7)",7.287,505.21,2875,0.228,"Post-Transition Metals",6,null,232.06,2601.85]
[51,"Sb","Antimony",15,5,"121.760(1)",6.685,904.05,1860,0.207,"Metalloids",7,null,630.9,1586.85]
[52,"Te","Tellurium",16,5,"127.60(3)",6.232,722.8,1261,0.202,"Metalloids",7,null,449.65,987.85]
[53,"I","Iodine",17,5,"126.90447(3)",4.93,386.65,457.4,0.214,"Halogens",9,null,113.5,184.25]
[54,"Xe","Xenon",18,5,"131.293(6)",0.005887,161.45,165.03,0.158,"Noble Gases",10,null,-111.69999999999999,-108.11999999999998]
[55,"Cs","Caesium",1,6,"132.9054519(2)",1.873,301.7,944,0.242,"Alkali Metals",1,null,28.55000000000001,670.85]
[56,"Ba","Barium",2,6,"137.327(7)",3.594,1002.15,2170,0.204,"Alkaline Earth Metals",2,null,729,1896.85]
[57,"La","Lanthanum",null,6,"138.90547(7)2",6.145,1193.15,3737,0.195,"Lanthanides",3,null,920.0000000000001,3463.85]
[58,"Ce","Cerium",null,6,"140.116(1)2",6.77,1071.15,3716,0.192,"Lanthanides",3,null,798.0000000000001,3442.85]
[59,"Pr","Praseodymium",null,6,"140.90765(2)",6.773,1204.15,3793,0.193,"Lanthanides",3,null,931.0000000000001,3519.85]
[60,"Nd","Neodymium",null,6,"144.242(3)",7.007,1289.15,3347,0.19,"Lanthanides",3,null,1016.0000000000001,3073.85]
[61,"Pm","Promethium",null,6,"[145]",7.26,1204.15,3273,"–","Lanthanides",3,null,931.0000000000001,2999.85]
[62,"Sm","Samarium",null,6,"150.36(2)",7.52,1345.15,2067,0.197,"Lanthanides",3,null,1072,1793.85]
[63,"Eu","Europium",null,6,"151.964(1)",5.243,1095.15,1802,0.182,"Lanthanides",3,null,822.0000000000001,1528.85]
[64,"Gd","Gadolinium",null,6,"157.25(3)",7.895,1585.15,3546,0.236,"Lanthanides",3,null,1312,3272.85]
[65,"Tb","Terbium",null,6,"158.92535(2)",8.229,1630.15,3503,0.182,"Lanthanides",3,null,1357,3229.85]
[66,"Dy","Dysprosium",null,6,"162.500(1)",8.55,1680.15,2840,0.17,"Lanthanides",3,null,{"$f":"H68-273.15","v":1407},{"$f":"I68-273.15","v":2566.85}]
[67,"Ho","Holmium",null,6,"164.93032(2)",8.795,1743.15,2993,0.165,"Lanthanides",3,null,1470,2719.85]
[68,"Er","Erbium",null,6,"167.259(3)",9.066,1795.15,3503,0.168,"Lanthanides",3,null,1522,3229.85]
[69,"Tm","Thulium",null,6,"168.93421(2)",9.321,1818.15,2223,0.16,"Lanthanides",3,null,1545,1949.85]
[70,"Yb","Ytterbium",null,6,"173.054(5)",6.965,1097.15,1469,0.155,"Lanthanides",3,null,824.0000000000001,1195.85]
[71,"Lu","Lutetium",3,6,"174.9668(1)",9.84,1936.15,3675,0.154,"Lanthanides",3,null,1663,3401.85]
[72,"Hf","Hafnium",4,6,"178.49(2)",13.31,2500.15,4876,0.144,"Transition Metals",5,null,2227,4602.85]
[73,"Ta","Tantalum",5,6,"180.94788(2)",16.654,3269.15,5731,0.14,"Transition Metals",5,null,2996,5457.85]
[74,"W","Tungsten",6,6,"183.84(1)",19.25,3680.15,5828,0.132,"Transition Metals",5,null,3407,5554.85]
[75,"Re","Rhenium",7,6,"186.207(1)",21.02,3453.15,5869,0.137,"Transition Metals",5,null,3180,5595.85]
[76,"Os","Osmium",8,6,"190.23(3)",22.61,3300.15,5285,0.13,"Transition Metals",5,null,3027,5011.85]
[77,"Ir","Iridium",9,6,"192.217(3)",22.56,2716.15,4701,0.131,"Transition Metals",5,null,2443,4427.85]
[78,"Pt","Platinum",10,6,"195.084(9)",21.46,2045.15,4098,0.133,"Transition Metals",5,null,1772,3824.85]
[79,"Au","Gold",11,6,"196.966569(4)",19.282,1337.73,3129,0.129,"Transition Metals",5,null,1064.58,2855.85]
[80,"Hg","Mercury",12,6,"200.59(2)",13.5336,234.43,630,0.14,"Transition Metals",5,null,-38.71999999999997,356.85]
[81,"Tl","Thallium",13,6,"204.3833(2)",11.85,577.15,1746,0.129,"Post-Transition Metals",6,null,304,1472.85]
[82,"Pb","Lead",14,6,"207.2(1)",11.342,600.75,2022,0.129,"Post-Transition Metals",6,null,327.6,1748.85]
[83,"Bi","Bismuth",15,6,"208.98040(1)",9.807,544.67,1837,0.122,"Post-Transition Metals",6,null,271.52,1563.85]
[84,"Po","Polonium",16,6,"[209]",9.32,527.15,1235,"–","Metalloids",7,null,254,961.85]
[85,"At","Astatine",17,6,"[210]",7,575.15,610,"–","Halogens",9,null,302,336.85]
[86,"Rn","Radon",18,6,"[222]",0.00973,202.15,211.3,0.094,"Noble Gases",10,null,-70.99999999999997,-61.849999999999966]
[87,"Fr","Francium",1,7,"[223]",1.87,300.15,950,"–","Alkali Metals",1,null,27,676.85]
[88,"Ra","Radium",2,7,"[226]",5.5,973.15,2010,"–","Alkaline Earth Metals",2,null,700,1736.85]
[89,"Ac","Actinium",null,7,"[227]",10.07,1323.15,3471,0.12,"Actinides",4,null,1050,3197.85]
[90,"Th","Thorium",null,7,"232.03806(2)",11.72,2028.15,5061,0.113,"Actinides",4,null,1755,4787.85]
[91,"Pa","Protactinium",null,7,"231.03588(2)",15.37,1873.15,4300,"–","Actinides",4,null,1600,4026.85]
[92,"U","Uranium",null,7,"238.02891(3)",18.95,1405.15,4404,0.116,"Actinides",4,null,1132,4130.85]
[93,"Np","Neptunium",null,7,"[237]",20.45,913.15,4273,"–","Actinides",4,null,640,3999.85]
[94,"Pu","Plutonium",null,7,"[244]",19.84,913.15,3501,"–","Actinides",4,null,640,3227.85]
[95,"Am","Americium",null,7,"[243]",13.69,1267.15,2880,"–","Actinides",4,null,994.0000000000001,2606.85]
[96,"Cm","Curium",null,7,"[247]",13.51,1340.15,3383,"–","Actinides",4,null,1067,3109.85]
[97,"Bk","Berkelium",null,7,"[247]",14.79,1259.15,983,"–","Actinides",4,null,986.0000000000001,709.85]
[98,"Cf","Californium",null,7,"[251]",15.1,1925.15,1173,"–","Actinides",4,null,1652,899.85]
[99,"Es","Einsteinium",null,7,"[252]",13.5,1133.15,"–","–","Actinides",4,null,860.0000000000001,{"$error":"#VALUE!"}]
[100,"Fm","Fermium",null,7,"[257]","–",1800,"–","–","Actinides",4,null,1526.85,{"$error":"#VALUE!"}]
[101,"Md","Mendelevium",null,7,"[258]","–",1100,"–","–","Actinides",4,null,826.85,{"$error":"#VALUE!"}]
[102,"No","Nobelium",null,7,"[259]","–",1100,"–","–","Actinides",4,null,826.85,{"$error":"#VALUE!"}]
[103,"Lr","Lawrencium",3,7,"[262]","–",1900,"–","–","Actinides",4,null,1626.85,{"$error":"#VALUE!"}]
[104,"Rf","Rutherfordium",4,7,"[267]","–","–","–","–","Transition Metals",5,null,{"$error":"#VALUE!"},{"$error":"#VALUE!"}]
[105,"Db","Dubnium",5,7,"[268]","–","–","–","–","Transition Metals",5,null,{"$error":"#VALUE!"},{"$error":"#VALUE!"}]
[106,"Sg","Seaborgium",6,7,"[269]","–","–","–","–","Transition Metals",5,null,{"$error":"#VALUE!"},{"$error":"#VALUE!"}]
[107,"Bh","Bohrium",7,7,"[270]","–","–","–","–","Transition Metals",5,null,{"$error":"#VALUE!"},{"$error":"#VALUE!"}]
[108,"Hs","Hassium",8,7,"[269]","–","–","–","–","Transition Metals",5,null,{"$error":"#VALUE!"},{"$error":"#VALUE!"}]
[109,"Mt","Meitnerium",9,7,"[278]","–","–","–","–","Unknown",11,null,{"$error":"#VALUE!"},{"$error":"#VALUE!"}]
[110,"Ds","Darmstadtium",10,7,"[281]","–","–","–","–","Unknown",11,{"$nulls":3},"Density","Melt","Boil","Heat","Classification"]
[111,"Rg","Roentgenium",11,7,"[281]","–","–","–","–","Unknown",11,null,null,{"$f":"valSymbol","v":"Th"},{"$f":"LOOKUP($O$113,Data!$B$3:$B$120,Data!G3:G120)","v":"–"},{"$f":"LOOKUP($O$113,Data!$B$3:$B$120,Data!H3:H120)","v":"–"},{"$f":"LOOKUP($O$113,Data!$B$3:$B$120,Data!I3:I120)","v":"–"},{"$f":"LOOKUP($O$113,Data!$B$3:$B$120,Data!J3:J120)","v":"–"},{"$f":"LOOKUP($O$113,Data!$B$3:$B$120,Data!K3:K120)","v":"Transition Metals"}]
[112,"Cn","Copernicium",12,7,"[285]","–","–","–","–","Transition Metals",5]
[113,"Uut","Ununtrium",13,7,"[286]","–","–","–","–","Unknown",11]
[114,"Fl","Flerovium",14,7,"[289]","–","–","–","–","Unknown",11]
[115,"Uup","Ununpentium",15,7,"[288]","–","–","–","–","Unknown",11]
[116,"Lv","Livermorium",16,7,"[293]","–","–","–","–","Unknown",11]
[117,"Uus","Ununseptium",17,7,"[294]","–","–","–","–","Unknown",11]
[118,"Uuo","Ununoctium",18,7,"[294]","–","–","–","–","Unknown",11]