{"text_format":"1","workbook":"xlsx","n_sheets":12,"sheets":["Açıklama","Reçete Dizayn-renkli","Sheet2","Sheet3","Sheet4","Sheet5","Sheet6","Sheet7","Sheet8","Siyah-Beyaz","Diğer","Otomatik Gradasyon"],"not_rendered":{"charts":17,"images":4,"macros":1,"external_links":0,"defined_names":124,"comments":1,"pivot_tables":0},"unopened":[],"bounds":{"document_bytes":16777216,"sheet_cells":100000,"rows_first":2000,"rows_last":500,"rows_between":2000,"halvings":0,"cell_chars":16384,"cell_head_chars":4096},"cells_cut":0,"cells_raw":0,"read":"whole","date_system":"1900"}

{"sheet":"Açıklama","index":0,"n_rows":16,"n_cols":21,"rows_kept":16,"cut":false,"hidden":false,"merged":[[2,1,2,9],[4,1,4,9],[6,1,6,9],[15,14,15,18],[11,20,11,21],[11,11,11,15],[2,11,5,21],[7,11,7,21],[9,11,9,21]]}
[]
[]
[null,"SADECE SARI KUTULARA VERİ GİRİNİZ",null,null,null,null,null,null,null,null,null,"HAZIRLAYAN: YASİN ENGİN (İnş.Yük.Müh)               "]
[]
[null,"VERİLERİ SADECE \"REÇETE DİZAYN-renkli\" SAYFASINA GİRİNİZ"]
[]
[null,"\"SİYAH-BEYAZ\" VE \"DİĞER\" İSİMLİ SAYFALAR ÇIKTI İÇİN KULLANILABİLİR."]
[null,null,null,null,null,null,null,null,null,null,null,"www.betonvecimento.com "]
[]
[null,null,null,null,null,null,null,null,null,null,null,"yasin.engin@gmail.com"]
[]
[null,null,null,null,null,null,null,null,null,null,null,"Güncelleme Kontrol Et",null,null,null,null,null,null,null,"Versiyon 5","Eylül, 2015"]
[]
[]
[]
[null,null,null,null,null,null,null,null,null,null,null,null,null,null,"TIKLA TAKİP ET!"]

{"sheet":"Reçete Dizayn-renkli","index":1,"n_rows":55,"n_cols":25,"rows_kept":55,"cut":false,"hidden":false,"merged":[[0,0,0,8],[21,9,22,11],[21,12,22,12],[22,6,23,6],[6,1,6,6],[6,7,7,7],[22,7,23,7],[22,5,23,5],[2,3,2,4],[22,0,23,0],[22,1,23,1],[22,2,23,2],[22,3,23,3],[22,4,23,4],[3,3,3,4],[2,6,2,7],[2,9,2,10],[3,9,3,10],[2,11,2,12],[3,11,3,12],[23,9,25,9],[23,10,25,10],[23,11,25,11],[23,12,25,12],[5,9,5,12],[5,0,5,7],[35,23,35,24],[36,23,36,24],[37,23,37,24],[38,23,38,24],[36,21,36,22],[0,9,0,10],[0,11,0,12],[27,9,27,10],[27,11,27,12],[30,12,31,12],[30,9,31,9],[29,9,29,11],[30,10,31,10],[30,11,31,11],[33,13,33,20],[29,23,30,24],[34,23,34,24],[26,23,26,24],[29,21,30,21],[29,22,30,22],[33,21,33,22],[34,21,34,22],[37,21,37,22],[35,21,35,22],[39,23,39,24],[40,23,40,24],[41,23,41,24],[42,23,42,24],[24,19,27,20],[28,19,30,20],[24,21,25,24],[27,21,28,21],[27,22,28,22],[32,21,32,24],[33,23,33,24],[38,21,38,22],[27,23,28,24],[44,23,44,24],[45,23,45,24],[53,17,54,17],[53,18,54,18],[43,21,43,22],[44,21,44,22],[45,21,45,22],[48,17,49,17],[48,18,49,18],[47,13,47,24],[46,23,46,24],[48,14,49,14],[43,23,43,24],[53,7,54,7],[51,7,52,7],[46,21,46,22],[53,11,54,11],[51,12,52,12],[53,12,54,12],[49,9,49,10],[49,11,49,12],[51,11,52,11],[50,11,50,12],[47,11,48,11],[47,12,48,12],[51,0,51,6],[39,21,39,22],[40,21,40,22],[41,21,41,22],[42,21,42,22],[40,0,40,6],[50,0,50,1],[50,4,50,5],[39,1,39,7],[48,13,49,13],[48,16,49,16],[48,15,49,15],[47,9,48,9],[47,10,48,10]]}
["BETON REÇETE DİZAYN PROGRAMI",null,null,null,null,null,null,null,null,"Rapor No/Tarih"]
[]
["Beton Sınıfı","C30/37",{"$f":"IF(B3<Sheet4!I4,\"DEĞİŞTİR\",\"\")","v":""},"Çev. Etki Sınıfı",null,"XC2",{"$f":"IF(B3<Sheet4!I4,Sheet4!I9,\"\")","v":""},null,null,"Klorür Sınıfı",null,{"$f":"IF(ISERROR(IF(Sheet2!F21=0,\"\",Sheet2!D27)),\"\",IF(Sheet2!F21=0,\"\",Sheet2!D27))","v":""},null,null,100,100,100,100,100,100,{"$f":"H23","v":100}]
["Çimento Sınıfı","CEM I",null,"Min.Katkı k değeri",null,0.4,null,null,null,"Alkali Miktarı(kg/m3)",null,{"$f":"IF(ISERROR(IF(Sheet3!F26=0,\"\",Sheet3!F26)),\"\",IF(Sheet3!F26=0,\"\",Sheet3!F26))","v":""},null,null,{"$f":"B23","v":25},{"$f":"C23","v":20},25,{"$f":"E23","v":30},{"$f":"F23","v":0},{"$f":"G23","v":0}]
[]
["AGREGA GRADASYON HESAPLAMASI",null,null,null,null,null,null,null,null,"BİLEŞEN ÖZELLİKLERİ"]
["ELEK EBATI","ELEKTEN GEÇEN MALZEME (%)",null,null,null,null,null,"KARIŞIM",null,"Bileşen","Öz.Ağırlık","Cl(%)","Alkali(%)"]
["( mm )","1 NO","2 NO","T.TOZU","D.KUM","K.KUM","G.D.AGR.",null,null,"1 NO",2.7]
[31.5,100,100,100,100,null,null,{"$f":"($B$23*B9+$C$23*C9+$D$23*D9+$E$23*E9+$F$23*F9+$G$23*G9)/100","v":100},null,"2 NO",2.7]
[22.4,100,82.166666666666657,100,100,null,null,96.433333333333323,null,"T.TOZU",2.69]
[19,100,48.966666666666669,100,100,null,null,89.793333333333337,null,"D.KUM",2.62]
[16,98,21.666666666666671,100,100,null,null,83.833333333333343,null,"K.KUM",2.61]
[11.2,54.633333333333333,0.96666666666666856,100,100,null,null,68.851666666666659,null,"G.D.AGR."]
[8,11,0.3333333333333286,100,100,null,null,57.816666666666663,null,"ÇİMENTO 1",3.1]
[5.6,2.0666666666666771,0.3333333333333286,95.6,100,null,null,54.483333333333341,null,"ÇİMENTO 2",3.04]
[4,0.3333333333333286,0.3333333333333286,77.7,90,null,null,46.575000000000003,null,"SU",1]
[2,0.26666666666666572,0.20000000000000284,55.9,51,null,null,29.381666666666671,null,"G.D.SU",1.03]
[1,0.26666666666666572,0.20000000000000284,39.200000000000003,35,null,null,20.40666666666667,null,"UÇUCU KÜL",2.5]
[0.5,0.26666666666666572,0.20000000000000284,23.8,26,null,null,13.856666666666667,null,"S. DUMANI"]
[0.25,0.26666666666666572,0.20000000000000284,11.8,20,null,null,9.0566666666666666,null,"KİM. KATKI 1",1.1000000000000001]
[0.125,0.1,0.1,7,14,null,null,5.9950000000000001,1,"KİM. KATKI 2 "]
[6.3E-2,0,0,2,3,null,null,1.4,null,{"$f":"IF(K24>Sheet4!H4,\"SU/ÇİMENTO DÜZELT\",\"\")","v":""},null,null,{"$f":"IF(K24>Sheet4!H4,Sheet4!H9,\"\")","v":""}]
["MİKTAR(%)",25,20,25,30,0,0,{"$f":"SUM(B23:G24)","v":100}]
[null,null,null,null,null,null,null,null,null,"Su/Çimento",0.57999999999999996,"Su(kg)",{"$f":"IF((K24*(B43+B44+B45*F4+B46*2))=0,\"\",K24*(B43+B44+B45*F4+B46*2))","v":176.32}]
["İncelik Modülü",{"$f":"IF(B23>0,(600-SUM(B16:B21))/100,\"\")","v":5.9850000000000003},{"$f":"IF(C23>0,(600-SUM(C16:C21))/100,\"\")","v":5.9876666666666667},3.8459999999999996,3.64,"","",4.7472833333333329,null,null,null,null,null,null,null,null,null,null,null,"ÇOK İNCE MALZEME MUHTEVASI                    (TS 13515)                         (<0,125mm) (kg)",null,"ÇOK İNCE MALZEME MUHTEVASI                    (EN 12620) ( <0,063mm)"]
[6.3E-2,{"$f":"IF($I$21=1,Sheet8!C3,Sheet8!G3)","v":1},5,{"$f":"AVERAGE(B26:C26)","v":3},{"$f":"$H$22","v":1.4},{"$f":"IF(ISERROR(G43/$K$46),\"\",G43/$K$46)","v":7.2811459343413834E-2}]
[0.125,{"$f":"IF($I$21=1,Sheet8!C4,Sheet8!G4)","v":2.5},{"$f":"IF($I$21=1,Sheet8!D4,Sheet8!H4)","v":8.5},{"$f":"IF($I$21=1,Sheet8!E4,Sheet8!I4)","v":5.5},{"$f":"$H$21","v":5.9950000000000001},{"$f":"IF(ISERROR(G44/$K$46),\"\",G44/$K$46)","v":5.8249167474731051E-2},{"$f":"IF(ISERROR(G43/1000),\"\",G43/1000)","v":0.17131662756598243},"Agrega",null,null,null,null,null,null,null,null,null,null,null,null,null,"Tip","Değer(%)","Sınıf"]
[0.25,{"$f":"IF($I$21=1,Sheet8!C5,Sheet8!G5)","v":6},{"$f":"IF($I$21=1,Sheet8!D5,Sheet8!H5)","v":15},{"$f":"IF($I$21=1,Sheet8!E5,Sheet8!I5)","v":10.5},{"$f":"$H$20","v":9.0566666666666666},7.2811459343413834E-2,{"$f":"IF(ISERROR(G44/1000),\"\",G44/1000)","v":0.1370533020527859},"Bağlayıcı",null,"Kompasite",null,{"$f":"IF(ISERROR(SUM(L33:L40,L42,L43)/M48),\"\",SUM(L33:L40,L42,L43)/M48)","v":0.78959447885689149},null,null,null,null,null,null,null,null,null,"İnce Agrega",{"$f":"IF(ISERROR((D22*D23+E22*E23+F22*F23+G22*G23)/(D23+E23+F23+G23)),\"\",(D22*D23+E22*E23+F22*F23+G22*G23)/(D23+E23+F23+G23))","v":2.5454545454545454},{"$f":"IF(W28=\"\",\"\",IF(W28<=3,\"f3\",IF(AND(W28>3,W28<=10),\"f10\",IF(AND(W28>10,W28<=16),\"f16\",IF(AND(W28>16,W28<=22),\"f22\",IF(W28>22,\"fbeyan\"))))))","v":"f3"}]
[0.5,{"$f":"IF($I$21=1,Sheet8!C6,Sheet8!G6)","v":10},{"$f":"IF($I$21=1,Sheet8!D6,Sheet8!H6)","v":22},{"$f":"IF($I$21=1,Sheet8!E6,Sheet8!I6)","v":16},{"$f":"$H$19","v":13.856666666666667},8.737375121209659E-2,0.17131662756598243,"Su",null,null,null,null,null,null,null,null,null,null,null,{"$f":"IF(ISERROR(K39+K40+K42+K43+(H21*(K33+K34+K35+K36+K37+K38)/100)),\"\",K39+K40+K42+K43+(H21*(K33+K34+K35+K36+K37+K38)/100))","v":449.23282091814804}]
[1,{"$f":"IF($I$21=1,Sheet8!C7,Sheet8!G7)","v":16},{"$f":"IF($I$21=1,Sheet8!D7,Sheet8!H7)","v":32},{"$f":"IF($I$21=1,Sheet8!E7,Sheet8!I7)","v":24},{"$f":"$H$18","v":20.40666666666667},0,0.2055799530791789,null,null,"DÜZELTİLMİŞ REÇETE (1 m3)",null,null,7,null,null,null,null,null,null,null,null,"İri     Agrega",{"$f":"IF(ISERROR((B22*B23+C23*C22)/(C23+B23)),\"\",(B22*B23+C23*C22)/(C23+B23))","v":0},{"$f":"IF(W30=\"\",\"\",IF(W30<=3,\"f3\",IF(AND(W30>3,W30<=10),\"f10\",IF(AND(W30>10,W30<=16),\"f16\",IF(AND(W30>16,W30<=22),\"f22\",IF(W30>22,\"fbeyan\"))))))","v":"f3"}]
[2,{"$f":"IF($I$21=1,Sheet8!C8,Sheet8!G8)","v":25},{"$f":"IF($I$21=1,Sheet8!D8,Sheet8!H8)","v":43},{"$f":"IF($I$21=1,Sheet8!E8,Sheet8!I8)","v":34},{"$f":"$H$17","v":29.381666666666671},0,0,{"$f":"SUM(F26:F31)","v":0.29124583737365528},{"$f":"SUM(G26:G31)","v":0.6852665102639296},"Bileşen   ","Ağırlık (kg)","Hacim (dm3)","Ağırlık   (g)"]
[4,{"$f":"IF($I$21=1,Sheet8!C9,Sheet8!G9)","v":37},{"$f":"IF($I$21=1,Sheet8!D9,Sheet8!H9)","v":56},{"$f":"IF($I$21=1,Sheet8!E9,Sheet8!I9)","v":46.5},{"$f":"$H$16","v":46.575000000000003},{"$f":"IF(ISERROR(K39/$K$46),\"\",K39/$K$46)","v":0.11900309331214076},0,{"$f":"SUM(F32:F33,F35,F36)","v":0.14450375616474234},{"$f":"SUM(G33:G34,G36,G37)","v":0.11432258064516129}]
[5.6,{"$f":"IF($I$21=1,Sheet8!C10,Sheet8!G10)","v":46},{"$f":"IF($I$21=1,Sheet8!D10,Sheet8!H10)","v":64},{"$f":"IF($I$21=1,Sheet8!E10,Sheet8!I10)","v":55},{"$f":"$H$15","v":54.483333333333341},0,{"$f":"IF(ISERROR(L39/1000),\"\",L39/1000)","v":9.0322580645161285E-2},{"$f":"F34","v":7.4937947902845206E-2},{"$f":"G35","v":0.17632},{"$f":"$J$8","v":"1 NO"},{"$f":"IFERROR(H43*$K$16+G43*K8,\"\")","v":462.55489442815258},{"$f":"IFERROR(IF(G43=0,\"\",(G43+H43)),\"\")","v":171.31662756598243},{"$f":"IF(ISERROR($M$30*K33),\"\",$M$30*K33)","v":3237.8842609970679},null,null,null,null,null,null,null,null,"Elek Arası Kalan (%)"]
[8,{"$f":"IF($I$21=1,Sheet8!C11,Sheet8!G11)","v":54},{"$f":"IF($I$21=1,Sheet8!D11,Sheet8!H11)","v":71},{"$f":"IF($I$21=1,Sheet8!E11,Sheet8!I11)","v":62.5},{"$f":"$H$14","v":57.816666666666663},{"$f":"IF(ISERROR(F49/$K$46),\"\",F49/$K$46)","v":7.4937947902845206E-2},0,null,null,{"$f":"$J$9","v":"2 NO"},{"$f":"IFERROR(H44*$K$16+G44*K9,\"\")","v":370.04391554252197},{"$f":"IFERROR(IF(G44=0,\"\",(G44+H44)),\"\")","v":137.05330205278591},{"$f":"IF(ISERROR($M$30*K34),\"\",$M$30*K34)","v":2590.3074087976538},"Pompa ile iletilen betonda kullanılacak ince agrega için tane dağılım eğrileri",null,null,null,null,null,null,null,{"$f":"A9&\"-\"&A10","v":"31,5-22,4"},null,{"$f":"H9-H10","v":3.5666666666666771}]
[11.2,{"$f":"IF($I$21=1,Sheet8!C12,Sheet8!G12)","v":63.5},{"$f":"IF($I$21=1,Sheet8!D12,Sheet8!H12)","v":79},{"$f":"IF($I$21=1,Sheet8!E12,Sheet8!I12)","v":71.25},{"$f":"$H$13","v":68.851666666666659},2.550066285260159E-2,{"$f":"IF(ISERROR(G49/1000),\"\",G49/1000)","v":0.17632},null,null,{"$f":"$J$10","v":"T.TOZU"},456.23331087096784,166.70821028445749,3193.6331760967751,null,6.3E-2,0,3,{"$f":"AVERAGE(P35:Q35)","v":1.5},{"$f":"($D$23*D22+$E$23*E22+$F$23*F22)/($D$23+$E$23+$F$23)","v":2.5454545454545454},null,null,{"$f":"A10&\"-\"&A11","v":"22,4-19"},null,{"$f":"H10-H11","v":6.6399999999999864}]
[16,{"$f":"IF($I$21=1,Sheet8!C13,Sheet8!G13)","v":73},{"$f":"IF($I$21=1,Sheet8!D13,Sheet8!H13)","v":86},{"$f":"IF($I$21=1,Sheet8!E13,Sheet8!I13)","v":79.5},{"$f":"$H$12","v":83.833333333333343},0,2.4E-2,null,null,{"$f":"$J$11","v":"D.KUM"},533.23328229677429,200.19375830850441,3732.6329760774202,null,0.125,2.5,9,{"$f":"AVERAGE(P36:Q36)","v":5.75},{"$f":"($D$23*D21+$E$23*E21+$F$23*F21)/($D$23+$E$23+$F$23)","v":10.818181818181818},null,null,"19-16",null,5.9599999999999937]
[19,{"$f":"IF($I$21=1,Sheet8!C14,Sheet8!G14)","v":80.5},{"$f":"IF($I$21=1,Sheet8!D14,Sheet8!H14)","v":91},{"$f":"IF($I$21=1,Sheet8!E14,Sheet8!I14)","v":85.75},{"$f":"$H$11","v":89.793333333333337},1.9125497139451193E-3,"",null,null,{"$f":"$J$12","v":"K.KUM"},0,"",0,null,0.25,8,25,16.5,{"$f":"($D$23*D20+$E$23*E20+$F$23*F20)/($D$23+$E$23+$F$23)","v":16.272727272727273},null,null,"16-11,2",null,14.981666666666683]
[22.4,{"$f":"IF($I$21=1,Sheet8!C15,Sheet8!G15)","v":89},{"$f":"IF($I$21=1,Sheet8!D15,Sheet8!H15)","v":96},{"$f":"IF($I$21=1,Sheet8!E15,Sheet8!I15)","v":92.5},{"$f":"$H$10","v":96.433333333333323},0,4.0909090909090912E-3,null,null,{"$f":"$J$13","v":"G.D.AGR."},0,"",0,null,0.5,20,50,35,{"$f":"($D$23*D19+$E$23*E19+$F$23*F19)/($D$23+$E$23+$F$23)","v":25},null,null,"11,2-8",null,11.034999999999997]
[31.5,{"$f":"IF($I$21=1,Sheet8!C16,Sheet8!G16)","v":100},{"$f":"IF($I$21=1,Sheet8!D16,Sheet8!H16)","v":100},{"$f":"IF($I$21=1,Sheet8!E16,Sheet8!I16)","v":100},{"$f":"$H$9","v":100},1,"",null,null,{"$f":"$J$14","v":"ÇİMENTO 1"},{"$f":"IF(B43=\"\",\"\",$B$43)","v":280},{"$f":"IF(ISERROR($K$39/$K$14),\"\",$K$39/$K$14)","v":90.322580645161281},1960,null,1,44,74,59,{"$f":"($D$23*D18+$E$23*E18+$F$23*F18)/($D$23+$E$23+$F$23)","v":36.909090909090907},null,null,"8-5,6",null,3.3333333333333215]
["Dmaks",null,null,null,null,null,null,null,null,{"$f":"$J$15","v":"ÇİMENTO 2"},{"$f":"IF(B44=\"\",\"\",$B$44)","v":0},{"$f":"IF(ISERROR($K$40/$K$15),\"\",$K$40/$K$15)","v":0},0,null,2,69,90,79.5,{"$f":"($D$23*D17+$E$23*E17+$F$23*F17)/($D$23+$E$23+$F$23)","v":53.227272727272727},null,null,"5,6-4",null,7.9083333333333385]
["BİLEŞEN MİKTARLARI (kg - dm3)",null,null,null,null,null,null,"Dmaks",null,{"$f":"$J$16","v":"SU"},{"$f":"IF(ISERROR($G$49-(SUM($H$43:$H$48))),\"\",$G$49-(SUM($H$43:$H$48)))","v":186.31461205219941},{"$f":"IF(ISERROR($K$41/$K$16),\"\",$K$41/$K$16)","v":186.31461205219941},1304.2022843653958,null,4,85,98,91.5,{"$f":"($D$23*D16+$E$23*E16+$F$23*F16)/($D$23+$E$23+$F$23)","v":84.409090909090907},null,null,"4-2",null,17.193333333333332]
["Bileşen   ","Ağırlık","Hacim",null,"Bileşen","Ağırlık ","Hacim ",null,null,{"$f":"$J$18","v":"UÇUCU KÜL"},{"$f":"IF(B45=\"\",\"\",$B$45)","v":60},{"$f":"IF(ISERROR($K$42/$K$18),\"\",$K$42/$K$18)","v":24},420,null,5.6,95,100,97.5,{"$f":"($D$23*D15+$E$23*E15+$F$23*F15)/($D$23+$E$23+$F$23)","v":98},null,null,"2-1",null,8.9750000000000014]
[{"$f":"$J$14","v":"ÇİMENTO 1"},280,{"$f":"IF(ISERROR(B43/$K$14),\"\",B43/$K$14)","v":90.322580645161281},null,{"$f":"$J$8","v":"1 NO"},{"$f":"IF(ISERROR(G43*K8),\"\",G43*K8)","v":462.55489442815258},{"$f":"IF(ISERROR((1000-$D$49-$G$49)*$B$23/100),\"\",(1000-$D$49-$G$49)*$B$23/100)","v":171.31662756598243},{"$f":"(B54-B55)*F43/100","v":0},null,{"$f":"$J$19","v":"S. DUMANI"},{"$f":"IF(B46=\"\",\"\",$B$46)","v":0},{"$f":"IF(ISERROR($K$43/$K$19),\"\",$K$43/$K$19)","v":""},0,null,8,100,100,100,{"$f":"($D$23*D14+$E$23*E14+$F$23*F14)/($D$23+$E$23+$F$23)","v":100},null,null,"1-0,5",null,6.5500000000000025]
[{"$f":"$J$15","v":"ÇİMENTO 2"},0,{"$f":"IF(ISERROR(B44/$K$15),\"\",B44/$K$15)","v":0},null,{"$f":"$J$9","v":"2 NO"},{"$f":"IF(ISERROR(G44*K9),\"\",G44*K9)","v":370.04391554252197},{"$f":"IF(ISERROR((1000-$D$49-$G$49)*$C$23/100),\"\",(1000-$D$49-$G$49)*$C$23/100)","v":137.05330205278591},{"$f":"(C54-C55)*F44/100","v":0},null,{"$f":"$J$20","v":"KİM. KATKI 1"},{"$f":"IF(B47=\"\",\"\",$B$47)","v":4.5},{"$f":"IF(ISERROR($K$44/$K$20),\"\",$K$44/$K$20)","v":4.0909090909090908},31.5,null,null,null,null,null,null,null,null,"0,5-0,25",null,4.8000000000000007]
[{"$f":"$J$18","v":"UÇUCU KÜL"},60,{"$f":"IF(ISERROR(B45/$K$18),\"\",B45/$K$18)","v":24},null,{"$f":"$J$10","v":"T.TOZU"},460.84172815249275,{"$f":"IF(ISERROR((1000-$D$49-$G$49)*$D$23/100),\"\",(1000-$D$49-$G$49)*$D$23/100)","v":171.31662756598243},{"$f":"(D54-D55)*F45/100","v":-4.6084172815249271},null,{"$f":"$J$21","v":"KİM. KATKI 2 "},{"$f":"IF(B48=\"\",\"\",$B$48)","v":0},{"$f":"IF(ISERROR($K$45/$K$21),\"\",$K$45/$K$21)","v":""},0,null,null,null,null,null,null,null,null,"0,25-0,125",null,3.0616666666666665]
[{"$f":"$J$19","v":"S. DUMANI"},0,{"$f":"IF(ISERROR(B46/$K$19),\"\",B46/$K$19)","v":""},null,{"$f":"$J$11","v":"D.KUM"},538.61947706744877,{"$f":"IF(ISERROR((1000-$D$49-$G$49)*$E$23/100),\"\",(1000-$D$49-$G$49)*$E$23/100)","v":205.57995307917889},{"$f":"(E54-E55)*F46/100","v":-5.3861947706744875},null,"TOPLAM",{"$f":"IF(SUM(K33:K45)=0,\"\",SUM(K33:K45))","v":2352.8800151906157},{"$f":"IF((SUM($L$33:$L$45)+$C$49)=0,\"\",(SUM($L$33:$L$45)+$C$49))","v":1000.0000000000001},16470.160106334311,null,null,null,null,null,null,null,null,"0,125-0,063",null,4.5950000000000006]
[{"$f":"$J$20","v":"KİM. KATKI 1"},4.5,{"$f":"IF(ISERROR(B47/$K$20),\"\",B47/$K$20)","v":4.0909090909090908},null,{"$f":"$J$12","v":"K.KUM"},0,{"$f":"IF(ISERROR((1000-$D$49-$G$49)*$F$23/100),\"\",(1000-$D$49-$G$49)*$F$23/100)","v":0},{"$f":"(F54-F55)*F47/100","v":0},null,null,null,null,null,null,null,null,null,null,null,null,null,"<0,063",null,{"$f":"H22","v":1.4}]
[{"$f":"$J$21","v":"KİM. KATKI 2 "},0,{"$f":"IF(ISERROR(B48/$K$21),\"\",B48/$K$21)","v":""},null,{"$f":"$J$13","v":"G.D.AGR."},0,{"$f":"IF(ISERROR((1000-$D$49-$G$49)*$G$23/100),\"\",(1000-$D$49-$G$49)*$G$23/100)","v":0},{"$f":"(G54-G55)*F48/100","v":0},null,"Birim Ağırlık (kg/m3)",{"$f":"SUM(K33:K45)","v":2352.8800151906157}," Hacim (dm3)",{"$f":"SUM(L33:L45)+C49","v":1000.0000000000001},"MALİYET HESABI"]
["HAVA",0,20,{"$f":"SUM(C43:C49)","v":138.41348973607037},{"$f":"$J$16","v":"SU"},{"$f":"IF(ISERROR(G49*K16),\"\",G49*K16)","v":176.32},{"$f":"IF(ISERROR($M$24*$K$16),\"\",$M$24*$K$16)","v":176.32},"CÜRUF",null,null,null,null,null,"Bileşen","Fiyat","Bileşen","Fiyat","Bileşen","Fiyat"]
[null,null,null,null,null,null,null,"UÇUCU KÜL",null,"Ölçülen Birim Ağırlık",null,null,null,null,null,null,null,null,null,null,null,null,null,"Toplam",{"$f":"SUM(Y51:Y55)","v":0}]
["Birim Ağırlık (kg/m3)",null,{"$f":"SUM(B43:B49,F43:F49)","v":2352.8800151906166},null," Hacim (dm3)",null,{"$f":"SUM(C43:C49,G43:G49)","v":1000},null,null,3,"MPa","Sıcaklık (oC)",null,{"$f":"$J$14","v":"ÇİMENTO 1"},null,{"$f":"$J$8","v":"1 NO"},null,{"$f":"A47","v":"KİM. KATKI 1"},null,null,null,"Çimento",{"$f":"(O51*K39+K40*O52)/1000","v":0},{"$f":"V55","v":"Su"},{"$f":"W55","v":0}]
["NEM DÜZELTME",null,null,null,null,null,null,"Su Farkı(kg)",null,"3 GÜN",null,"Ortam",null,{"$f":"$J$15","v":"ÇİMENTO 2"},null,{"$f":"$J$9","v":"2 NO"},null,{"$f":"A48","v":"KİM. KATKI 2 "},null,null,null,"Mineral Katkı",{"$f":"(K42*O53+K43*O54)/1000","v":0},{"$f":"V53","v":"Kimyasal Katkı"},{"$f":"W53","v":0}]
[null,"1 NO","2 NO","T.TOZU","D.KUM","K.KUM","G.D.AGR.",null,null,"7 GÜN",null,null,null,{"$f":"$J$18","v":"UÇUCU KÜL"},null,{"$f":"$J$10","v":"T.TOZU"},null,{"$f":"E48","v":"G.D.AGR."},null,null,null,"Kimyasal Katkı",{"$f":"(K44*S51+K45*S52)/1000","v":0},{"$f":"V52","v":"Mineral Katkı"},{"$f":"W52","v":0}]
["Nem  (%)",1,1,2,2,null,null,{"$f":"IF(ISERROR(K41-F49),\"\",K41-F49)","v":9.9946120521994146},null,"28 GÜN",null,"Beton",null,{"$f":"$J$19","v":"S. DUMANI"},null,{"$f":"$J$11","v":"D.KUM"},null,"TOPLAM (TL)",{"$f":"IF(ISERROR(O51*K39+K40*O52+K42*O53+K43*O54+K44*S51+K45*S52+K33*Q51+K34*Q52+K35*Q53+K36*Q54+K37*Q55+K41*O55),\"\",IF((O51*K39+K40*O52+K42*O53+K43*O54+K44*S51+K45*S52+K33*Q51+K34*Q52+K35*Q53+K36*Q54+K37*Q55+K41*O55)=0,\"\",(O51*K39+K40*O52+K42*O53+K43*O54+K44*S51+K45*S52+K33*Q51+K34*Q52+K35*Q53+K36*Q54+K37*Q55+K41*O55)))","v":""},null,null,"Agrega",{"$f":"(Q51*K33+K34*Q52+Q53*K35+K36*Q54+Q55*K37)/1000","v":0},{"$f":"V51","v":"Çimento"},{"$f":"W51","v":0}]
["Su emme (%)",1,1,3,3,null,null,null,null,"Slump(cm)",null,null,null,{"$f":"E49","v":"SU"},null,{"$f":"$J$12","v":"K.KUM"},null,null,null,null,null,"Su",{"$f":"O55*K41/1000","v":0},{"$f":"V54","v":"Agrega"},{"$f":"W54","v":0}]

{"sheet":"Sheet2","index":2,"n_rows":27,"n_cols":8,"rows_kept":27,"cut":false,"hidden":true,"merged":[[26,3,26,4],[1,2,1,5],[3,3,3,4],[4,4,4,5],[4,7,4,10],[19,2,19,5],[20,2,20,4]]}
[]
[null,null,"Klorür İçeriği Hesabı"]
[]
[null,null,null,"VERİLERİ GİRİNİZ"]
[null,null,"Bileşenler","Ağırlık, kg","           Klorür İçeriği",null,null,"TS EN 206-1'e göre Klorür İçeriği Sınıfları"]
[null,null,{"$f":"'Reçete Dizayn-renkli'!J8","v":"1 NO"},{"$f":"'Reçete Dizayn-renkli'!K33","v":462.55489442815258},{"$f":"'Reçete Dizayn-renkli'!L8","v":0},"%",{"$f":"D6*E6/100","v":0}]
[null,null,{"$f":"'Reçete Dizayn-renkli'!J9","v":"2 NO"},{"$f":"'Reçete Dizayn-renkli'!K34","v":370.04391554252197},{"$f":"'Reçete Dizayn-renkli'!L9","v":0},"%",{"$f":"D7*E7/100","v":0}]
[null,null,{"$f":"'Reçete Dizayn-renkli'!J10","v":"T.TOZU"},{"$f":"'Reçete Dizayn-renkli'!K35","v":456.23331087096784},{"$f":"'Reçete Dizayn-renkli'!L10","v":0},"%",0]
[null,null,{"$f":"'Reçete Dizayn-renkli'!J11","v":"D.KUM"},{"$f":"'Reçete Dizayn-renkli'!K36","v":533.23328229677429},{"$f":"'Reçete Dizayn-renkli'!L11","v":0},"%",0]
[null,null,{"$f":"'Reçete Dizayn-renkli'!J12","v":"K.KUM"},{"$f":"'Reçete Dizayn-renkli'!K37","v":0},{"$f":"'Reçete Dizayn-renkli'!L12","v":0},"%",0]
[null,null,{"$f":"'Reçete Dizayn-renkli'!J13","v":"G.D.AGR."},{"$f":"'Reçete Dizayn-renkli'!K38","v":0},{"$f":"'Reçete Dizayn-renkli'!L13","v":0},"%",0]
[null,null,{"$f":"'Reçete Dizayn-renkli'!J14","v":"ÇİMENTO 1"},{"$f":"'Reçete Dizayn-renkli'!K39","v":280},{"$f":"'Reçete Dizayn-renkli'!L14","v":0},"%",0]
[null,null,{"$f":"'Reçete Dizayn-renkli'!J15","v":"ÇİMENTO 2"},{"$f":"'Reçete Dizayn-renkli'!K40","v":0},{"$f":"'Reçete Dizayn-renkli'!L15","v":0},"%",0]
[null,null,{"$f":"'Reçete Dizayn-renkli'!J16","v":"SU"},{"$f":"'Reçete Dizayn-renkli'!K41","v":186.31461205219941},{"$f":"'Reçete Dizayn-renkli'!L16","v":0},"ppm",0]
[null,null,{"$f":"'Reçete Dizayn-renkli'!J17","v":"G.D.SU"},null,{"$f":"'Reçete Dizayn-renkli'!L17","v":0},"ppm",0]
[null,null,{"$f":"'Reçete Dizayn-renkli'!J18","v":"UÇUCU KÜL"},{"$f":"'Reçete Dizayn-renkli'!K42","v":60},{"$f":"'Reçete Dizayn-renkli'!L18","v":0},"%",0]
[null,null,{"$f":"'Reçete Dizayn-renkli'!J19","v":"S. DUMANI"},{"$f":"'Reçete Dizayn-renkli'!K43","v":0},{"$f":"'Reçete Dizayn-renkli'!L19","v":0},"%",0]
[null,null,{"$f":"'Reçete Dizayn-renkli'!J20","v":"KİM. KATKI 1"},{"$f":"'Reçete Dizayn-renkli'!K44","v":4.5},{"$f":"'Reçete Dizayn-renkli'!L20","v":0},"%",0]
[null,null,{"$f":"'Reçete Dizayn-renkli'!J21","v":"KİM. KATKI 2 "},{"$f":"'Reçete Dizayn-renkli'!K45","v":0},{"$f":"'Reçete Dizayn-renkli'!L21","v":0},"%",0]
[]
[null,null,"Klorür İçeriği (kg/m3)",null,null,{"$f":"SUM(G6:G19)","v":0},{"$f":"F21/(D12+D13)*100","v":0}]
[]
[]
[]
[]
[]
[null,null,"Klorür Sınıfı",{"$f":"IF(G21<0.1,\"Cl 0.1\",IF(AND(0.2>G21,G21>=0.1),\"Cl 0.2\",IF(AND(0.2<=G21,G21<0.4),\"Cl 0.4\",\"UYGUN DEĞİL\")))","v":"Cl 0.1"}]

{"sheet":"Sheet3","index":3,"n_rows":40,"n_cols":7,"rows_kept":40,"cut":false,"hidden":true,"merged":[[6,2,6,5],[39,6,40,6],[8,3,8,4],[9,4,9,5],[24,6,24,7],[24,2,24,5],[25,2,25,4],[25,6,25,7]]}
[]
[]
[]
[]
[]
[]
[null,null,"Toplam Alkali İçeriği Hesabı"]
[]
[null,null,null,"VERİLERİ GİRİNİZ"]
[null,null,"Bileşenler","Ağırlık, kg","            Alkali İçeriği"]
[null,null,{"$f":"'Reçete Dizayn-renkli'!J8","v":"1 NO"},{"$f":"'Reçete Dizayn-renkli'!K33","v":462.55489442815258},{"$f":"'Reçete Dizayn-renkli'!M8","v":0},"%",{"$f":"D11*E11/100","v":0}]
[null,null,{"$f":"'Reçete Dizayn-renkli'!J9","v":"2 NO"},{"$f":"'Reçete Dizayn-renkli'!K34","v":370.04391554252197},{"$f":"'Reçete Dizayn-renkli'!M9","v":0},"%",{"$f":"D12*E12/100","v":0}]
[null,null,{"$f":"'Reçete Dizayn-renkli'!J10","v":"T.TOZU"},{"$f":"'Reçete Dizayn-renkli'!K35","v":456.23331087096784},{"$f":"'Reçete Dizayn-renkli'!M10","v":0},"%",0]
[null,null,{"$f":"'Reçete Dizayn-renkli'!J11","v":"D.KUM"},{"$f":"'Reçete Dizayn-renkli'!K36","v":533.23328229677429},{"$f":"'Reçete Dizayn-renkli'!M11","v":0},"%",0]
[null,null,{"$f":"'Reçete Dizayn-renkli'!J12","v":"K.KUM"},{"$f":"'Reçete Dizayn-renkli'!K37","v":0},{"$f":"'Reçete Dizayn-renkli'!M12","v":0},"%",0]
[null,null,{"$f":"'Reçete Dizayn-renkli'!J13","v":"G.D.AGR."},{"$f":"'Reçete Dizayn-renkli'!K38","v":0},{"$f":"'Reçete Dizayn-renkli'!M13","v":0},"%",0]
[null,null,{"$f":"'Reçete Dizayn-renkli'!J14","v":"ÇİMENTO 1"},{"$f":"'Reçete Dizayn-renkli'!K39","v":280},{"$f":"'Reçete Dizayn-renkli'!M14","v":0},"%",0]
[null,null,{"$f":"'Reçete Dizayn-renkli'!J15","v":"ÇİMENTO 2"},{"$f":"'Reçete Dizayn-renkli'!K40","v":0},{"$f":"'Reçete Dizayn-renkli'!M15","v":0},"%",0]
[null,null,{"$f":"'Reçete Dizayn-renkli'!J16","v":"SU"},{"$f":"'Reçete Dizayn-renkli'!K41","v":186.31461205219941},{"$f":"'Reçete Dizayn-renkli'!M16","v":0},"ppm",{"$f":"D19*E19/1000000","v":0}]
[null,null,{"$f":"'Reçete Dizayn-renkli'!J17","v":"G.D.SU"},null,{"$f":"'Reçete Dizayn-renkli'!M17","v":0},"ppm",{"$f":"D20*E20/1000000","v":0}]
[null,null,{"$f":"'Reçete Dizayn-renkli'!J18","v":"UÇUCU KÜL"},{"$f":"'Reçete Dizayn-renkli'!K42","v":60},{"$f":"'Reçete Dizayn-renkli'!M18","v":0},"%",0]
[null,null,{"$f":"'Reçete Dizayn-renkli'!J19","v":"S. DUMANI"},{"$f":"'Reçete Dizayn-renkli'!K43","v":0},{"$f":"'Reçete Dizayn-renkli'!M19","v":0},"%",0]
[null,null,{"$f":"'Reçete Dizayn-renkli'!J20","v":"KİM. KATKI 1"},{"$f":"'Reçete Dizayn-renkli'!K44","v":4.5},{"$f":"'Reçete Dizayn-renkli'!M20","v":0},"%",0]
[null,null,{"$f":"'Reçete Dizayn-renkli'!J21","v":"KİM. KATKI 2 "},{"$f":"'Reçete Dizayn-renkli'!K45","v":0},{"$f":"'Reçete Dizayn-renkli'!M21","v":0},"%",0]
[]
[null,null,"Toplam Alkali(kg/m3)",null,null,{"$f":"SUM(G11:G24)","v":0},{"$f":"IF(F26>3,\"UYGUN DEĞİL\",\"UYGUN\")","v":"UYGUN"}]
[]
[]
[null,null,null,null,{"$f":"F26","v":0},"kg"]
[]
[]
[]
[]
[]
[]
[]
[]
[]
[]
[null,null,null,null,null,null,"ANASAYFA"]

{"sheet":"Sheet4","index":4,"n_rows":63,"n_cols":16,"rows_kept":63,"cut":false,"hidden":true,"merged":[]}
[]
["X0","-","C8/10","-","-"]
["XA1",0.6,"C25/30",280,270]
["XA2",0.5,"C35/45",320,270,null,"≤",{"$f":"LOOKUP('Reçete Dizayn-renkli'!F3,Sheet4!A2:B25)","v":0.65},{"$f":"LOOKUP('Reçete Dizayn-renkli'!F3,Sheet4!A2:C25)","v":"C25/30"},null,null,null,"CEM I",null,null,"C20/25"]
["XA3",0.45,"C35/45",320,270,null,"≥",null,null,null,null,null,"CEM II",null,null,"C25/30"]
["XC1",0.7,"C20/25",240,240,null,null,null,null,null,null,null,null,null,null,"C30/37"]
["XC2",0.65,"C25/30",260,240,null,null,null,null,null,null,null,null,null,null,"C35/45"]
["XC3",0.6,"C30/37",270,240,null,null,null,null,null,null,null,null,null,null,"C40/50"]
["XC4",0.55000000000000004,"C30/37",280,270,null,null,{"$f":"G4&\"\"&H4","v":"≤0,65"},{"$f":"G5&\"\"&I4","v":"≥C25/30"},null,null,null,null,null,null,"C45/55"]
["XD1",0.55000000000000004,"C30/37",300,270,null,null,null,null,null,null,null,null,null,null,"C50/60"]
["XD2",0.5,"C35/45",320,270,null,null,null,null,null,null,null,null,null,null,"C55/67"]
["XD3",0.45,"C35/45",320,270,null,null,null,null,null,null,null,null,null,null,"C60/75"]
["XF1",0.6,"C25/30",280,270,null,null,null,null,null,null,null,null,null,null,"C70/85"]
["XF2-1",0.55000000000000004,"C25/30",300,270,null,null,null,null,null,null,null,null,null,null,"C80/95"]
["XF2-2",0.5,"C35/45",320,270,null,null,null,null,null,null,null,null,null,null,"C90/105"]
["XF3-1",0.55000000000000004,"C25/30",300,270,null,null,null,null,null,null,null,null,null,null,"C100/115"]
["XF3-2",0.5,"C35/45",320,270]
["XF4",0.5,"C30/37",320,270]
["XM1",0.55000000000000004,"C30/37",300,270]
["XM2-1",0.55000000000000004,"C30/37",300,270]
["XM2-2",0.45,"C35/45",320,270]
["XM3",0.45,"C35/45",320,270]
["XS1",0.55000000000000004,"C30/37",300,270]
["XS2",0.5,"C35/45",320,270]
["XS3",0.45,"C35/45",320,270,null,null,null,null,0.2]
[null,null,null,null,null,null,null,null,null,0.4]
[null,null,null,null,null,null,null,null,null,0.6]
[null,null,null,null,null,null,null,null,null,0.8]
[null,null,null,null,null,null,null,null,null,1]
[null,null,null,null,null,null,null,null,null,2]
[]
[]
[]
[]
[]
[]
[]
[]
[]
[null,null,"X0","-","C8/10","-","-"]
[null,null,"XA1",0.6,"C25/30",280,270]
[null,null,"XA2",0.5,"C35/45",320,270]
[null,null,"XA3",0.45,"C35/45",320,270]
[null,null,"XC1",0.7,"C20/25",240,240]
[null,null,"XC2",0.65,"C25/30",260,240]
[null,null,"XC3",0.6,"C30/37",270,240]
[null,null,"XC4",0.55000000000000004,"C30/37",280,270]
[null,null,"XD1",0.55000000000000004,"C30/37",300,270]
[null,null,"XD2",0.5,"C35/45",320,270]
[null,null,"XD3",0.45,"C35/45",320,270]
[null,null,"XF1",0.6,"C25/30",280,270]
[null,null,"XF2-1",0.55000000000000004,"C25/30",300,270]
[null,null,"XF2-2",0.5,"C35/45",320,270]
[null,null,"XF3-1",0.55000000000000004,"C25/30",300,270]
[null,null,"XF3-2",0.5,"C35/45",320,270]
[null,null,"XF4",0.5,"C30/37",320,270]
[null,null,"XM1",0.55000000000000004,"C30/37",300,270]
[null,null,"XM2-1",0.55000000000000004,"C30/37",300,270]
[null,null,"XM2-2",0.45,"C35/45",320,270]
[null,null,"XM3",0.45,"C35/45",320,270]
[null,null,"XS1",0.55000000000000004,"C30/37",300,270]
[null,null,"XS2",0.5,"C35/45",320,270]
[null,null,"XS3",0.45,"C35/45",320,270]

{"sheet":"Sheet5","index":5,"n_rows":27,"n_cols":24,"rows_kept":27,"cut":false,"hidden":true,"merged":[[22,4,23,7],[22,8,23,9],[22,14,23,14],[26,3,27,10],[15,4,15,9],[15,12,15,14],[17,4,18,7],[17,8,18,9],[17,10,18,10],[8,20,13,22],[8,23,13,25],[11,4,13,4],[11,5,13,7],[0,20,2,22],[0,23,2,25],[3,20,7,22],[3,23,7,25],[8,11,13,13],[8,14,13,16],[8,17,13,19],[0,17,2,19],[3,11,7,13],[3,14,7,16],[3,17,7,19],[0,0,21,0],[0,3,2,7],[0,8,2,10],[0,11,2,13],[0,14,2,16],[19,4,20,7],[19,8,20,9],[19,10,20,10],[21,8,21,9],[8,3,13,3],[8,4,10,4],[8,5,10,7],[8,8,13,10],[3,3,7,3],[3,4,7,7],[3,8,7,10]]}
["SEÇİNİZ",18,null,"Çevresel Etki Sınıfı",null,null,null,null,"En büyük su/çimento oranı",null,null,"En düşük beton sınıfı",null,null,"En az çimento (bağlayıcı) içeriği(kg/m3)",null,null,"Mineral katkı ile birlikte en az çimento içeriği(kg/m3)",null,null,"En az hava içeriği(%)",null,null,"Diğer özellikler"]
[]
[]
[null,null,null,"TS 13515","XA1",null,null,null,0.6,null,null,"C25/30",null,null,280,null,null,270,null,null,0,null,null,0]
[]
[]
[]
[]
[null,null,null,"TS EN 206-1","A","Betonun kimyasal etkilere maruz kalması",null,null,0.55000000000000004,null,null,"C30/37",null,null,300,null,null,"-",null,null,"-",null,null,"-"]
[]
[]
[null,null,null,null,1,"Az zararlı kimyasal ortam"]
[]
[]
[]
[null,"Çimento Tipi",null,null,"TS 13515'e GÖRE SU MİKTARI HESAPLAMASI",null,null,null,null,null,null,null,"KULLANILABİLECEK ÇİMETO TİPLERİ"]
[null,null,null,null,null,null,null,null,null,null,null,null,"CEM I ","CEM II/B-W","CEM III/B"]
[null,null,null,null,"Çimento miktarı(kg)",null,null,null,300,null,{"$f":"IF(B1=1,\"Uygun\",IF(AND(B1<>1,I18>=R4),\"Uygun\",\"Uygun Değil\"))","v":"Uygun"},null,"CEM II/A-S","CEM II/A-LL","CEM III/C"]
[null,"Mineral katkı",null,null,null,null,null,null,null,null,null,null,"CEM II/B-S","CEM II/B-LL","CEM IV/A"]
[null,null,null,null,"Mineral katkı miktarı(kg)",null,null,null,null,null,"",null,"CEM II/A-P","CEM II/A-L ","CEM IV/B"]
[null,null,null,null,null,null,null,null,null,null,null,null,"CEM II/B-P","CEM II/B-L ","CEM V/A"]
[null,null,null,null,null," ",280,null,"",null,null,null,"CEM II/A-V","CEM II/A-M","CEM V/B"]
[null,null,null,null,"Max. su miktarı(kg)",null,null,null,180,null,null,null,"CEM II/B-V","CEM II/B-M"]
[null,null,null,null,null,null,null,null,null,null,null,null,"CEM II/A-W","CEM III/A"]
[null,"Uygun Değil"]
[]
[null,null,null,"SADECE SARI RENKLİ HÜCRELERE VERİ GİRİNİZ."]

{"sheet":"Sheet6","index":6,"n_rows":29,"n_cols":21,"rows_kept":29,"cut":false,"hidden":true,"merged":[[0,1,0,6]]}
[null,"TS 13515"]
["X0","-","C8/10","-","-","-","-","-","C12/15","-","-","-","-"]
["XC1",0.7,"C20/25",240,240,"-","-",0.65,"C20/25",260,"-","-","-"]
["XC2",0.65,"C25/30",260,240,"-","-",0.6,"C25/30",280,"-","-","-"]
["XC3",0.6,"C30/37",270,240,"-","-",0.55000000000000004,"C30/37",280,"-","-","-",null,1,1,null,300,0,{"$f":"#VALUE!","v":{"$error":"#VALUE!"}},{"$f":"R5+T5","v":{"$error":"#VALUE!"}}]
["XC4",0.55000000000000004,"C30/37",280,270,"-","-",0.5,"C30/37",280,"-","-","-",null,"YOK","CEM I"]
["XD1",0.55000000000000004,"C30/37",300,270,"-","-",0.55000000000000004,"C30/37",300,"-","-","-",null,"Cüruf","CEM II"]
["XD2",0.5,"C35/45",320,270,"-","-",0.55000000000000004,"C30/37",300,"-","-","-",null,"Uçucu kül"]
["XD3",0.45,"C35/45",320,270,"-","-",0.45,"C35/45",320,"-","-","-",null,"Silis dumanı"]
["XS1",0.55000000000000004,"C30/37",300,270,"-","-",0.5,"C30/37",300,"-","-","-"]
["XS2",0.5,"C35/45",320,270,"-","-",0.45,"C35/45",320,"-","-","-"]
["XS3",0.45,"C35/45",320,270,"-","-",0.45,"C35/45",340,"-","-","-"]
["XF1",0.6,"C25/30",280,270,"-","F4",0.55000000000000004,"C30/37",300,"-","-","-"]
["XF2-1",0.55000000000000004,"C25/30",300,270,"Dmaks=16mm için %4.5 / Dmaks=32mm için %4","MS25",0.55000000000000004,"C25/30",300,"-",4,"-"]
["XF2-2",0.5,"C35/45",320,270,null,"MS25",0.55000000000000004,"C25/30",300,"-",4,"-"]
["XF3-1",0.55000000000000004,"C25/30",300,270,"Dmaks=16mm için %4.5 / Dmaks=32mm için %4","F2",0.5,"C30/37",320,"-",4,"-"]
["XF3-2",0.5,"C35/45",320,270,null,"F2",0.5,"C30/37",320,"-",4,"-"]
["XF4",0.5,"C30/37",320,270,"Dmaks=16mm için %4.5 / Dmaks=32mm için %4","MS18",0.45,"C30/37",340,"-",4,"-"]
["XA1",0.6,"C25/30",280,270,null,null,0.55000000000000004,"C30/37",300,"-","-","-"]
["XA2",0.5,"C35/45",320,270,null,null,0.5,"C30/37",320,"-","-","-"]
["XA3",0.45,"C35/45",320,270,null,null,0.45,"C35/45",360,"-","-","-"]
["XM1",0.55000000000000004,"C30/37",300,270,null,null,"-","-","-","-","-","-"]
["XM2-1",0.55000000000000004,"C30/37",300,270,null,null,"-","-","-","-","-","-"]
["XM2-2",0.45,"C35/45",320,270,null,null,"-","-","-","-","-","-"]
["XM3",0.45,"C35/45",320,270,null,null,"-","-","-","-","-","-"]
[]
[0.5,0.55000000000000004,{"$f":"A27*$U$5","v":{"$error":"#VALUE!"}},165,{"$f":"C27&\" - \"&D27","v":{"$error":"#VALUE!"}}]
[0.45,0.55000000000000004,{"$f":"A28*$U$5","v":{"$error":"#VALUE!"}},165,{"$f":"C28&\" - \"&D28","v":{"$error":"#VALUE!"}}]
[0.5,0.55000000000000004,{"$f":"A29*$U$5","v":{"$error":"#VALUE!"}},165,{"$f":"C29&\" - \"&D29","v":{"$error":"#VALUE!"}}]

{"sheet":"Sheet7","index":7,"n_rows":52,"n_cols":13,"rows_kept":52,"cut":false,"hidden":true,"merged":[[48,0,48,7],[50,9,51,9],[50,10,51,10],[50,11,51,11],[50,12,51,12],[21,5,22,5],[47,6,47,7],[22,12,23,12],[27,9,27,10],[27,11,27,12],[28,9,28,10],[28,11,28,12],[31,9,31,10],[31,11,31,12],[21,6,22,6],[21,7,22,7],[33,9,33,11],[37,0,37,7],[47,0,47,1],[47,2,47,3],[47,4,47,5],[21,0,22,0],[21,1,22,1],[21,2,22,2],[21,3,22,3],[21,4,22,4],[21,9,21,11],[22,9,23,9],[22,10,23,10],[22,11,23,11],[0,0,0,12],[2,3,2,4],[2,6,2,7],[2,9,2,10],[2,11,2,12],[3,3,3,4],[3,9,3,10],[3,11,3,12],[5,0,5,7],[5,9,5,12],[6,1,6,6],[6,7,7,7]]}
["BETON REÇETE DİZAYN PROGRAMI"]
[]
["Beton Sınıfı",{"$f":"'Reçete Dizayn-renkli'!B3","v":"C30/37"},null,"Çev. Etki Sınıfı",null,{"$f":"'Reçete Dizayn-renkli'!F3","v":"XC2"},null,null,null,"Klorür Sınıfı",null,{"$f":"'Reçete Dizayn-renkli'!L3","v":""},{"$f":"'Reçete Dizayn-renkli'!M3","v":0}]
["Çimento Sınıfı",{"$f":"'Reçete Dizayn-renkli'!B4","v":"CEM I"},null,"Min.Katkı k değeri",null,{"$f":"'Reçete Dizayn-renkli'!F4","v":0.4},null,null,null,"Alkali Miktarı(kg/m3)",null,{"$f":"'Reçete Dizayn-renkli'!L4","v":""},{"$f":"'Reçete Dizayn-renkli'!M4","v":0}]
[]
["AGREGA GRADASYON HESAPLAMASI",null,null,null,null,null,null,null,null,"BİLEŞEN ÖZELLİKLERİ"]
["ELEK EBATI","ELEKTEN GEÇEN MALZEME (%)",null,null,null,null,null,"KARIŞIM",null,null,"Öz.Ağırlık","Cl(%)","Alkali(%)"]
["( mm )","1 NO","2 NO","T.TOZU","D.KUM","K.KUM","G.D.AGR.",null,null,"1 NO",{"$f":"'Reçete Dizayn-renkli'!K8","v":2.7},{"$f":"'Reçete Dizayn-renkli'!L8","v":0},{"$f":"'Reçete Dizayn-renkli'!M8","v":0}]
[31.5,{"$f":"'Reçete Dizayn-renkli'!B9","v":100},{"$f":"'Reçete Dizayn-renkli'!C9","v":100},{"$f":"'Reçete Dizayn-renkli'!D9","v":100},{"$f":"'Reçete Dizayn-renkli'!E9","v":100},{"$f":"'Reçete Dizayn-renkli'!F9","v":0},{"$f":"'Reçete Dizayn-renkli'!G9","v":0},{"$f":"($B$22*B9+$C$22*C9+$D$22*D9+$E$22*E9+$F$22*F9+$G$22*G9)/100","v":100},null,"2 NO",{"$f":"'Reçete Dizayn-renkli'!K9","v":2.7},{"$f":"'Reçete Dizayn-renkli'!L9","v":0},{"$f":"'Reçete Dizayn-renkli'!M9","v":0}]
[22.4,{"$f":"'Reçete Dizayn-renkli'!B10","v":100},{"$f":"'Reçete Dizayn-renkli'!C10","v":82.166666666666657},{"$f":"'Reçete Dizayn-renkli'!D10","v":100},{"$f":"'Reçete Dizayn-renkli'!E10","v":100},{"$f":"'Reçete Dizayn-renkli'!F10","v":0},{"$f":"'Reçete Dizayn-renkli'!G10","v":0},{"$f":"($B$22*B10+$C$22*C10+$D$22*D10+$E$22*E10+$F$22*F10+$G$22*G10)/100","v":96.433333333333323},null,"T.TOZU",{"$f":"'Reçete Dizayn-renkli'!K10","v":2.69},{"$f":"'Reçete Dizayn-renkli'!L10","v":0},{"$f":"'Reçete Dizayn-renkli'!M10","v":0}]
[19,{"$f":"'Reçete Dizayn-renkli'!B11","v":100},{"$f":"'Reçete Dizayn-renkli'!C11","v":48.966666666666669},{"$f":"'Reçete Dizayn-renkli'!D11","v":100},{"$f":"'Reçete Dizayn-renkli'!E11","v":100},{"$f":"'Reçete Dizayn-renkli'!F11","v":0},{"$f":"'Reçete Dizayn-renkli'!G11","v":0},89.793333333333337,null,"D.KUM",{"$f":"'Reçete Dizayn-renkli'!K11","v":2.62},{"$f":"'Reçete Dizayn-renkli'!L11","v":0},{"$f":"'Reçete Dizayn-renkli'!M11","v":0}]
[16,{"$f":"'Reçete Dizayn-renkli'!B12","v":98},{"$f":"'Reçete Dizayn-renkli'!C12","v":21.666666666666671},{"$f":"'Reçete Dizayn-renkli'!D12","v":100},{"$f":"'Reçete Dizayn-renkli'!E12","v":100},{"$f":"'Reçete Dizayn-renkli'!F12","v":0},{"$f":"'Reçete Dizayn-renkli'!G12","v":0},83.833333333333343,null,"K.KUM",{"$f":"'Reçete Dizayn-renkli'!K12","v":2.61},{"$f":"'Reçete Dizayn-renkli'!L12","v":0},{"$f":"'Reçete Dizayn-renkli'!M12","v":0}]
[11.2,{"$f":"'Reçete Dizayn-renkli'!B13","v":54.633333333333333},{"$f":"'Reçete Dizayn-renkli'!C13","v":0.96666666666666856},{"$f":"'Reçete Dizayn-renkli'!D13","v":100},{"$f":"'Reçete Dizayn-renkli'!E13","v":100},{"$f":"'Reçete Dizayn-renkli'!F13","v":0},{"$f":"'Reçete Dizayn-renkli'!G13","v":0},68.851666666666659,null,"G.D.AGR.",{"$f":"'Reçete Dizayn-renkli'!K13","v":0},{"$f":"'Reçete Dizayn-renkli'!L13","v":0},{"$f":"'Reçete Dizayn-renkli'!M13","v":0}]
[8,{"$f":"'Reçete Dizayn-renkli'!B14","v":11},{"$f":"'Reçete Dizayn-renkli'!C14","v":0.3333333333333286},{"$f":"'Reçete Dizayn-renkli'!D14","v":100},{"$f":"'Reçete Dizayn-renkli'!E14","v":100},{"$f":"'Reçete Dizayn-renkli'!F14","v":0},{"$f":"'Reçete Dizayn-renkli'!G14","v":0},57.816666666666663,null,"ÇİMENTO 1",{"$f":"'Reçete Dizayn-renkli'!K14","v":3.1},{"$f":"'Reçete Dizayn-renkli'!L14","v":0},{"$f":"'Reçete Dizayn-renkli'!M14","v":0}]
[5.6,{"$f":"'Reçete Dizayn-renkli'!B15","v":2.0666666666666771},{"$f":"'Reçete Dizayn-renkli'!C15","v":0.3333333333333286},{"$f":"'Reçete Dizayn-renkli'!D15","v":95.6},{"$f":"'Reçete Dizayn-renkli'!E15","v":100},{"$f":"'Reçete Dizayn-renkli'!F15","v":0},{"$f":"'Reçete Dizayn-renkli'!G15","v":0},54.483333333333341,null,"ÇİMENTO 2",{"$f":"'Reçete Dizayn-renkli'!K15","v":3.04},{"$f":"'Reçete Dizayn-renkli'!L15","v":0},{"$f":"'Reçete Dizayn-renkli'!M15","v":0}]
[4,{"$f":"'Reçete Dizayn-renkli'!B16","v":0.3333333333333286},{"$f":"'Reçete Dizayn-renkli'!C16","v":0.3333333333333286},{"$f":"'Reçete Dizayn-renkli'!D16","v":77.7},{"$f":"'Reçete Dizayn-renkli'!E16","v":90},{"$f":"'Reçete Dizayn-renkli'!F16","v":0},{"$f":"'Reçete Dizayn-renkli'!G16","v":0},46.575000000000003,null,"SU",{"$f":"'Reçete Dizayn-renkli'!K16","v":1},{"$f":"'Reçete Dizayn-renkli'!L16","v":0},{"$f":"'Reçete Dizayn-renkli'!M16","v":0}]
[2,{"$f":"'Reçete Dizayn-renkli'!B17","v":0.26666666666666572},{"$f":"'Reçete Dizayn-renkli'!C17","v":0.20000000000000284},{"$f":"'Reçete Dizayn-renkli'!D17","v":55.9},{"$f":"'Reçete Dizayn-renkli'!E17","v":51},{"$f":"'Reçete Dizayn-renkli'!F17","v":0},{"$f":"'Reçete Dizayn-renkli'!G17","v":0},29.381666666666671,null,"G.D.SU",{"$f":"'Reçete Dizayn-renkli'!K17","v":1.03},{"$f":"'Reçete Dizayn-renkli'!L17","v":0},{"$f":"'Reçete Dizayn-renkli'!M17","v":0}]
[1,{"$f":"'Reçete Dizayn-renkli'!B18","v":0.26666666666666572},{"$f":"'Reçete Dizayn-renkli'!C18","v":0.20000000000000284},{"$f":"'Reçete Dizayn-renkli'!D18","v":39.200000000000003},{"$f":"'Reçete Dizayn-renkli'!E18","v":35},{"$f":"'Reçete Dizayn-renkli'!F18","v":0},{"$f":"'Reçete Dizayn-renkli'!G18","v":0},20.40666666666667,null,"CÜRUF",{"$f":"'Reçete Dizayn-renkli'!K18","v":2.5},{"$f":"'Reçete Dizayn-renkli'!L18","v":0},{"$f":"'Reçete Dizayn-renkli'!M18","v":0}]
[0.5,{"$f":"'Reçete Dizayn-renkli'!B19","v":0.26666666666666572},{"$f":"'Reçete Dizayn-renkli'!C19","v":0.20000000000000284},{"$f":"'Reçete Dizayn-renkli'!D19","v":23.8},{"$f":"'Reçete Dizayn-renkli'!E19","v":26},{"$f":"'Reçete Dizayn-renkli'!F19","v":0},{"$f":"'Reçete Dizayn-renkli'!G19","v":0},13.856666666666667,null,"S. DUMANI",{"$f":"'Reçete Dizayn-renkli'!K19","v":0},{"$f":"'Reçete Dizayn-renkli'!L19","v":0},{"$f":"'Reçete Dizayn-renkli'!M19","v":0}]
[0.25,{"$f":"'Reçete Dizayn-renkli'!B20","v":0.26666666666666572},{"$f":"'Reçete Dizayn-renkli'!C20","v":0.20000000000000284},{"$f":"'Reçete Dizayn-renkli'!D20","v":11.8},{"$f":"'Reçete Dizayn-renkli'!E20","v":20},{"$f":"'Reçete Dizayn-renkli'!F20","v":0},{"$f":"'Reçete Dizayn-renkli'!G20","v":0},9.0566666666666666,null,"KİM. KATKI 1",{"$f":"'Reçete Dizayn-renkli'!K20","v":1.1000000000000001},{"$f":"'Reçete Dizayn-renkli'!L20","v":0},{"$f":"'Reçete Dizayn-renkli'!M20","v":0}]
[0.125,{"$f":"'Reçete Dizayn-renkli'!B21","v":0.1},{"$f":"'Reçete Dizayn-renkli'!C21","v":0.1},{"$f":"'Reçete Dizayn-renkli'!D21","v":7},{"$f":"'Reçete Dizayn-renkli'!E21","v":14},{"$f":"'Reçete Dizayn-renkli'!F21","v":0},{"$f":"'Reçete Dizayn-renkli'!G21","v":0},5.9950000000000001,null,"KİM. KATKI 2 ",{"$f":"'Reçete Dizayn-renkli'!K21","v":0},{"$f":"'Reçete Dizayn-renkli'!L21","v":0},{"$f":"'Reçete Dizayn-renkli'!M21","v":0}]
["MİKTAR(%)",{"$f":"'Reçete Dizayn-renkli'!B23","v":25},{"$f":"'Reçete Dizayn-renkli'!C23","v":20},{"$f":"'Reçete Dizayn-renkli'!D23","v":25},{"$f":"'Reçete Dizayn-renkli'!E23","v":30},{"$f":"'Reçete Dizayn-renkli'!F23","v":0},{"$f":"'Reçete Dizayn-renkli'!G23","v":0},{"$f":"SUM(B22:G23)","v":100},null,null,null,null,{"$f":"IF(K23>Sheet4!H4,Sheet4!H9,\"\")","v":""}]
[null,{"$f":"'Reçete Dizayn-renkli'!B24","v":0},{"$f":"'Reçete Dizayn-renkli'!C24","v":0},{"$f":"'Reçete Dizayn-renkli'!D24","v":0},{"$f":"'Reçete Dizayn-renkli'!E24","v":0},{"$f":"'Reçete Dizayn-renkli'!F24","v":0},{"$f":"'Reçete Dizayn-renkli'!G24","v":0},null,null,"Su/Çimento",{"$f":"'Reçete Dizayn-renkli'!K24","v":0.57999999999999996},"Su(kg)",{"$f":"'Reçete Dizayn-renkli'!M24","v":176.32}]
[{"$f":"'Reçete Dizayn-renkli'!A26","v":6.3E-2},{"$f":"'Reçete Dizayn-renkli'!B26","v":1},{"$f":"'Reçete Dizayn-renkli'!C26","v":5},{"$f":"'Reçete Dizayn-renkli'!D26","v":3},{"$f":"'Reçete Dizayn-renkli'!E26","v":1.4},{"$f":"'Reçete Dizayn-renkli'!F26","v":7.2811459343413834E-2},{"$f":"'Reçete Dizayn-renkli'!G26","v":0},{"$f":"'Reçete Dizayn-renkli'!H26","v":0},null,null,{"$f":"'Reçete Dizayn-renkli'!K26","v":0},null,{"$f":"'Reçete Dizayn-renkli'!M26","v":0}]
[{"$f":"'Reçete Dizayn-renkli'!A27","v":0.125},{"$f":"'Reçete Dizayn-renkli'!B27","v":2.5},{"$f":"'Reçete Dizayn-renkli'!C27","v":8.5},{"$f":"'Reçete Dizayn-renkli'!D27","v":5.5},{"$f":"'Reçete Dizayn-renkli'!E27","v":5.9950000000000001},{"$f":"'Reçete Dizayn-renkli'!F27","v":5.8249167474731051E-2},{"$f":"'Reçete Dizayn-renkli'!G27","v":0.17131662756598243},{"$f":"'Reçete Dizayn-renkli'!H27","v":"Agrega"}]
[{"$f":"'Reçete Dizayn-renkli'!A28","v":0.25},{"$f":"'Reçete Dizayn-renkli'!B28","v":6},{"$f":"'Reçete Dizayn-renkli'!C28","v":15},{"$f":"'Reçete Dizayn-renkli'!D28","v":10.5},{"$f":"'Reçete Dizayn-renkli'!E28","v":9.0566666666666666},{"$f":"'Reçete Dizayn-renkli'!F28","v":7.2811459343413834E-2},{"$f":"'Reçete Dizayn-renkli'!G28","v":0.1370533020527859},{"$f":"'Reçete Dizayn-renkli'!H28","v":"Bağlayıcı"}]
[{"$f":"'Reçete Dizayn-renkli'!A29","v":0.5},{"$f":"'Reçete Dizayn-renkli'!B29","v":10},{"$f":"'Reçete Dizayn-renkli'!C29","v":22},{"$f":"'Reçete Dizayn-renkli'!D29","v":16},{"$f":"'Reçete Dizayn-renkli'!E29","v":13.856666666666667},{"$f":"'Reçete Dizayn-renkli'!F29","v":8.737375121209659E-2},{"$f":"'Reçete Dizayn-renkli'!G29","v":0.17131662756598243},{"$f":"'Reçete Dizayn-renkli'!H29","v":"Su"}]
[{"$f":"'Reçete Dizayn-renkli'!A30","v":1},{"$f":"'Reçete Dizayn-renkli'!B30","v":16},{"$f":"'Reçete Dizayn-renkli'!C30","v":32},{"$f":"'Reçete Dizayn-renkli'!D30","v":24},{"$f":"'Reçete Dizayn-renkli'!E30","v":20.40666666666667},{"$f":"'Reçete Dizayn-renkli'!F30","v":0},{"$f":"'Reçete Dizayn-renkli'!G30","v":0.2055799530791789},{"$f":"'Reçete Dizayn-renkli'!H30","v":0}]
[{"$f":"'Reçete Dizayn-renkli'!A31","v":2},{"$f":"'Reçete Dizayn-renkli'!B31","v":25},{"$f":"'Reçete Dizayn-renkli'!C31","v":43},{"$f":"'Reçete Dizayn-renkli'!D31","v":34},{"$f":"'Reçete Dizayn-renkli'!E31","v":29.381666666666671},{"$f":"'Reçete Dizayn-renkli'!F31","v":0},{"$f":"'Reçete Dizayn-renkli'!G31","v":0},{"$f":"'Reçete Dizayn-renkli'!H31","v":0.29124583737365528},{"$f":"SUM(G24:G29)","v":0.6852665102639296}]
[{"$f":"'Reçete Dizayn-renkli'!A32","v":4},{"$f":"'Reçete Dizayn-renkli'!B32","v":37},{"$f":"'Reçete Dizayn-renkli'!C32","v":56},{"$f":"'Reçete Dizayn-renkli'!D32","v":46.5},{"$f":"'Reçete Dizayn-renkli'!E32","v":46.575000000000003},{"$f":"'Reçete Dizayn-renkli'!F32","v":0.11900309331214076},{"$f":"'Reçete Dizayn-renkli'!G32","v":0},{"$f":"'Reçete Dizayn-renkli'!H32","v":0.14450375616474234},{"$f":"SUM(G30:G31,G33,G34)","v":0.2906425806451613}]
[{"$f":"'Reçete Dizayn-renkli'!A33","v":5.6},{"$f":"'Reçete Dizayn-renkli'!B33","v":46},{"$f":"'Reçete Dizayn-renkli'!C33","v":64},{"$f":"'Reçete Dizayn-renkli'!D33","v":55},{"$f":"'Reçete Dizayn-renkli'!E33","v":54.483333333333341},{"$f":"'Reçete Dizayn-renkli'!F33","v":0},{"$f":"'Reçete Dizayn-renkli'!G33","v":9.0322580645161285E-2},{"$f":"'Reçete Dizayn-renkli'!H33","v":7.4937947902845206E-2},{"$f":"G32","v":0}]
[{"$f":"'Reçete Dizayn-renkli'!A34","v":8},{"$f":"'Reçete Dizayn-renkli'!B34","v":54},{"$f":"'Reçete Dizayn-renkli'!C34","v":71},{"$f":"'Reçete Dizayn-renkli'!D34","v":62.5},{"$f":"'Reçete Dizayn-renkli'!E34","v":57.816666666666663},{"$f":"'Reçete Dizayn-renkli'!F34","v":7.4937947902845206E-2},{"$f":"'Reçete Dizayn-renkli'!G34","v":0},{"$f":"'Reçete Dizayn-renkli'!H34","v":0},null,"Kompasite",null,{"$f":"'Reçete Dizayn-renkli'!L34","v":137.05330205278591},{"$f":"'Reçete Dizayn-renkli'!M34","v":2590.3074087976538}]
[{"$f":"'Reçete Dizayn-renkli'!A35","v":11.2},{"$f":"'Reçete Dizayn-renkli'!B35","v":63.5},{"$f":"'Reçete Dizayn-renkli'!C35","v":79},{"$f":"'Reçete Dizayn-renkli'!D35","v":71.25},{"$f":"'Reçete Dizayn-renkli'!E35","v":68.851666666666659},{"$f":"'Reçete Dizayn-renkli'!F35","v":2.550066285260159E-2},{"$f":"'Reçete Dizayn-renkli'!G35","v":0.17632},{"$f":"'Reçete Dizayn-renkli'!H35","v":0}]
[{"$f":"'Reçete Dizayn-renkli'!A36","v":16},{"$f":"'Reçete Dizayn-renkli'!B36","v":73},{"$f":"'Reçete Dizayn-renkli'!C36","v":86},{"$f":"'Reçete Dizayn-renkli'!D36","v":79.5},{"$f":"'Reçete Dizayn-renkli'!E36","v":83.833333333333343},{"$f":"'Reçete Dizayn-renkli'!F36","v":0},{"$f":"'Reçete Dizayn-renkli'!G36","v":2.4E-2},{"$f":"'Reçete Dizayn-renkli'!H36","v":0},null,"DÜZELTİLMİŞ REÇETE",null,null,{"$f":"'Reçete Dizayn-renkli'!M36","v":3732.6329760774202}]
[{"$f":"'Reçete Dizayn-renkli'!A37","v":19},{"$f":"'Reçete Dizayn-renkli'!B37","v":80.5},{"$f":"'Reçete Dizayn-renkli'!C37","v":91},{"$f":"'Reçete Dizayn-renkli'!D37","v":85.75},{"$f":"'Reçete Dizayn-renkli'!E37","v":89.793333333333337},{"$f":"'Reçete Dizayn-renkli'!F37","v":1.9125497139451193E-3},{"$f":"'Reçete Dizayn-renkli'!G37","v":""},{"$f":"'Reçete Dizayn-renkli'!H37","v":0},null,null,"Ağırlık (kg)","Hacim (dm3)","Ağırlık (g)"]
[{"$f":"'Reçete Dizayn-renkli'!A38","v":22.4},{"$f":"'Reçete Dizayn-renkli'!B38","v":89},{"$f":"'Reçete Dizayn-renkli'!C38","v":96},{"$f":"'Reçete Dizayn-renkli'!D38","v":92.5},{"$f":"'Reçete Dizayn-renkli'!E38","v":96.433333333333323},{"$f":"'Reçete Dizayn-renkli'!F38","v":0},{"$f":"'Reçete Dizayn-renkli'!G38","v":4.0909090909090912E-3},{"$f":"'Reçete Dizayn-renkli'!H38","v":0},null,{"$f":"J8","v":"1 NO"},{"$f":"'Reçete Dizayn-renkli'!K38","v":0},{"$f":"'Reçete Dizayn-renkli'!L38","v":""},{"$f":"'Reçete Dizayn-renkli'!M38","v":0}]
[{"$f":"'Reçete Dizayn-renkli'!A39","v":31.5},{"$f":"'Reçete Dizayn-renkli'!B39","v":100},{"$f":"'Reçete Dizayn-renkli'!C39","v":100},{"$f":"'Reçete Dizayn-renkli'!D39","v":100},{"$f":"'Reçete Dizayn-renkli'!E39","v":100},{"$f":"'Reçete Dizayn-renkli'!F39","v":1},{"$f":"'Reçete Dizayn-renkli'!G39","v":""},{"$f":"'Reçete Dizayn-renkli'!H39","v":0},null,{"$f":"J9","v":"2 NO"},{"$f":"'Reçete Dizayn-renkli'!K39","v":280},{"$f":"'Reçete Dizayn-renkli'!L39","v":90.322580645161281},{"$f":"'Reçete Dizayn-renkli'!M39","v":1960}]
["BİLEŞEN MİKTARLARI",null,null,null,null,null,null,null,null,"T.TOZU",{"$f":"'Reçete Dizayn-renkli'!K41","v":186.31461205219941},{"$f":"'Reçete Dizayn-renkli'!L41","v":186.31461205219941},{"$f":"'Reçete Dizayn-renkli'!M41","v":1304.2022843653958}]
[null,"Ağırlık (kg)","Hacim (dm3)",null,null,"Ağırlık (kg)","Hacim (dm3)",null,null,"D.KUM",{"$f":"'Reçete Dizayn-renkli'!K42","v":60},{"$f":"'Reçete Dizayn-renkli'!L42","v":24},{"$f":"'Reçete Dizayn-renkli'!M42","v":420}]
[{"$f":"$J$14","v":"ÇİMENTO 1"},{"$f":"'Reçete Dizayn-renkli'!B43","v":280},{"$f":"'Reçete Dizayn-renkli'!C43","v":90.322580645161281},null,{"$f":"$J$8","v":"1 NO"},{"$f":"'Reçete Dizayn-renkli'!F43","v":462.55489442815258},{"$f":"'Reçete Dizayn-renkli'!G43","v":171.31662756598243},{"$f":"'Reçete Dizayn-renkli'!H43","v":0},null,"K.KUM",{"$f":"'Reçete Dizayn-renkli'!K43","v":0},{"$f":"'Reçete Dizayn-renkli'!L43","v":""},{"$f":"'Reçete Dizayn-renkli'!M43","v":0}]
[{"$f":"$J$15","v":"ÇİMENTO 2"},{"$f":"'Reçete Dizayn-renkli'!B44","v":0},{"$f":"'Reçete Dizayn-renkli'!C44","v":0},null,{"$f":"$J$9","v":"2 NO"},{"$f":"'Reçete Dizayn-renkli'!F44","v":370.04391554252197},{"$f":"'Reçete Dizayn-renkli'!G44","v":137.05330205278591},{"$f":"'Reçete Dizayn-renkli'!H44","v":0},null,"G.D.AGR.",{"$f":"'Reçete Dizayn-renkli'!K44","v":4.5},{"$f":"'Reçete Dizayn-renkli'!L44","v":4.0909090909090908},{"$f":"'Reçete Dizayn-renkli'!M44","v":31.5}]
[{"$f":"$J$18","v":"CÜRUF"},{"$f":"'Reçete Dizayn-renkli'!B45","v":60},{"$f":"'Reçete Dizayn-renkli'!C45","v":24},null,{"$f":"$J$10","v":"T.TOZU"},{"$f":"'Reçete Dizayn-renkli'!F45","v":460.84172815249275},{"$f":"'Reçete Dizayn-renkli'!G45","v":171.31662756598243},{"$f":"'Reçete Dizayn-renkli'!H45","v":-4.6084172815249271},null,"ÇİMENTO 1",{"$f":"'Reçete Dizayn-renkli'!K45","v":0},{"$f":"'Reçete Dizayn-renkli'!L45","v":""},{"$f":"'Reçete Dizayn-renkli'!M45","v":0}]
[{"$f":"$J$19","v":"S. DUMANI"},{"$f":"'Reçete Dizayn-renkli'!B46","v":0},{"$f":"'Reçete Dizayn-renkli'!C46","v":""},null,{"$f":"$J$11","v":"D.KUM"},{"$f":"'Reçete Dizayn-renkli'!F46","v":538.61947706744877},{"$f":"'Reçete Dizayn-renkli'!G46","v":205.57995307917889},{"$f":"'Reçete Dizayn-renkli'!H46","v":-5.3861947706744875},null,"ÇİMENTO 2",{"$f":"'Reçete Dizayn-renkli'!K46","v":2352.8800151906157},{"$f":"'Reçete Dizayn-renkli'!L46","v":1000.0000000000001},{"$f":"'Reçete Dizayn-renkli'!M46","v":16470.160106334311}]
[{"$f":"$J$20","v":"KİM. KATKI 1"},{"$f":"'Reçete Dizayn-renkli'!B47","v":4.5},{"$f":"'Reçete Dizayn-renkli'!C47","v":4.0909090909090908},null,{"$f":"$J$12","v":"K.KUM"},{"$f":"'Reçete Dizayn-renkli'!F47","v":0},{"$f":"'Reçete Dizayn-renkli'!G47","v":0},{"$f":"'Reçete Dizayn-renkli'!H47","v":0},null,"SU",{"$f":"'Reçete Dizayn-renkli'!K47","v":0},{"$f":"'Reçete Dizayn-renkli'!L47","v":0},{"$f":"'Reçete Dizayn-renkli'!M47","v":0}]
[{"$f":"$J$21","v":"KİM. KATKI 2 "},{"$f":"'Reçete Dizayn-renkli'!B48","v":0},{"$f":"'Reçete Dizayn-renkli'!C48","v":""},null,{"$f":"$J$13","v":"G.D.AGR."},{"$f":"'Reçete Dizayn-renkli'!F48","v":0},{"$f":"'Reçete Dizayn-renkli'!G48","v":0},{"$f":"'Reçete Dizayn-renkli'!H48","v":0},null,{"$f":"J18","v":"CÜRUF"},{"$f":"'Reçete Dizayn-renkli'!K48","v":2352.8800151906157},{"$f":"'Reçete Dizayn-renkli'!L48","v":" Hacim (dm3)"},{"$f":"'Reçete Dizayn-renkli'!M48","v":1000.0000000000001}]
["HAVA",{"$f":"'Reçete Dizayn-renkli'!B49","v":0},{"$f":"'Reçete Dizayn-renkli'!C49","v":20},null,{"$f":"$J$16","v":"SU"},{"$f":"'Reçete Dizayn-renkli'!F49","v":176.32},{"$f":"'Reçete Dizayn-renkli'!G49","v":176.32},"CÜRUF",null,{"$f":"J19","v":"S. DUMANI"},{"$f":"'Reçete Dizayn-renkli'!K49","v":0},{"$f":"'Reçete Dizayn-renkli'!L49","v":0},{"$f":"'Reçete Dizayn-renkli'!M49","v":0}]
[null,null,null,null,null,null,null,"UÇUCU KÜL",null,{"$f":"J20","v":"KİM. KATKI 1"},{"$f":"'Reçete Dizayn-renkli'!K50","v":0},{"$f":"'Reçete Dizayn-renkli'!L50","v":0},{"$f":"'Reçete Dizayn-renkli'!M50","v":0}]
["Birim Ağırlık (kg/m3)",null,{"$f":"'Reçete Dizayn-renkli'!C51","v":2352.8800151906166},{"$f":"'Reçete Dizayn-renkli'!D51","v":0}," Hacim (dm3)",null,{"$f":"'Reçete Dizayn-renkli'!G51","v":1000},{"$f":"'Reçete Dizayn-renkli'!H51","v":0},null,{"$f":"J21","v":"KİM. KATKI 2 "},{"$f":"'Reçete Dizayn-renkli'!K51","v":"MPa"},{"$f":"'Reçete Dizayn-renkli'!L51","v":"Sıcaklık (oC)"},{"$f":"'Reçete Dizayn-renkli'!M51","v":0}]
["NEM DÜZELTME",null,null,null,null,null,null,null,null,"TOPLAM",{"$f":"'Reçete Dizayn-renkli'!K52","v":0},{"$f":"'Reçete Dizayn-renkli'!L52","v":"Ortam"},{"$f":"'Reçete Dizayn-renkli'!M52","v":0}]
[null,"1 NO","2 NO","T.TOZU","D.KUM","K.KUM","G.D.AGR."]
["Nem  (%)",{"$f":"'Reçete Dizayn-renkli'!B54","v":1},{"$f":"'Reçete Dizayn-renkli'!C54","v":1},{"$f":"'Reçete Dizayn-renkli'!D54","v":2},{"$f":"'Reçete Dizayn-renkli'!E54","v":2},{"$f":"'Reçete Dizayn-renkli'!F54","v":0},{"$f":"'Reçete Dizayn-renkli'!G54","v":0},null,null,"Birim Ağırlık (kg/m3)",{"$f":"'Reçete Dizayn-renkli'!K54","v":0}," Hacim (dm3)",{"$f":"'Reçete Dizayn-renkli'!M54","v":0}]
["Su emme (%)",{"$f":"'Reçete Dizayn-renkli'!B55","v":1},{"$f":"'Reçete Dizayn-renkli'!C55","v":1},{"$f":"'Reçete Dizayn-renkli'!D55","v":3},{"$f":"'Reçete Dizayn-renkli'!E55","v":3},{"$f":"'Reçete Dizayn-renkli'!F55","v":0},{"$f":"'Reçete Dizayn-renkli'!G55","v":0},null,null,null,{"$f":"'Reçete Dizayn-renkli'!K55","v":0},null,{"$f":"'Reçete Dizayn-renkli'!M55","v":0}]

{"sheet":"Sheet8","index":8,"n_rows":16,"n_cols":9,"rows_kept":16,"cut":false,"hidden":true,"merged":[]}
[]
[]
[0.125,6.3E-2,1,5,{"$f":"AVERAGE(C3:D3)","v":3},null,1,5,{"$f":"AVERAGE(G3:H3)","v":3}]
[0.25,0.125,2.5,8.5,5.5,null,2.5,8.5,{"$f":"AVERAGE(G4:H4)","v":5.5}]
[0.5,0.25,6,15,10.5,null,6,16,{"$f":"AVERAGE(G5:H5)","v":11}]
[1,0.5,10,22,16,null,10,23,16.5]
[2,1,16,32,24,null,17,33,25]
[4,2,25,43,34,null,26,43,34.5]
[5.6,4,37,56,46.5,null,37,56,46.5]
[8,5.6,46,64,55,null,45,63,54]
[11.2,8,54,71,62.5,null,52,69,60.5]
[16,11.2,63.5,79,71.25,null,60.5,76,68.25]
[19,16,73,86,79.5,null,68,82,75]
[22.4,19,80.5,91,85.75,null,74,86,80]
[31.5,22.4,89,96,92.5,null,80,90,85]
[null,31.5,100,100,100,null,90,97,93.5]

{"sheet":"Siyah-Beyaz","index":9,"n_rows":56,"n_cols":14,"rows_kept":56,"cut":false,"hidden":false,"merged":[[50,10,50,11],[50,12,50,13],[51,12,51,13],[52,12,53,12],[52,13,53,13],[51,10,51,11],[52,8,53,8],[54,8,55,8],[54,12,55,12],[54,13,55,13],[51,1,51,2],[51,5,51,6],[52,1,52,7],[23,7,24,7],[23,8,24,8],[22,10,23,12],[31,13,32,13],[48,10,49,10],[48,11,49,11],[48,12,49,12],[48,13,49,13],[41,1,41,7],[31,10,32,10],[40,2,40,8],[23,2,24,2],[23,3,24,3],[23,4,24,4],[23,5,24,5],[23,6,24,6],[30,10,30,12],[31,11,32,11],[31,12,32,12],[24,13,26,13],[28,10,28,11],[28,12,28,13],[24,10,26,10],[24,11,26,11],[24,12,26,12],[22,13,23,13],[7,2,7,7],[7,8,8,8],[1,1,1,9],[1,10,1,11],[1,12,1,13],[3,4,3,5],[3,7,3,8],[3,10,3,11],[3,12,3,13],[4,4,4,5],[4,10,4,11],[4,12,4,13],[6,1,6,8],[6,10,6,13],[23,1,24,1]]}
[]
[null,"BETON REÇETE DİZAYN PROGRAMI",null,null,null,null,null,null,null,null,"Rapor No/Tarih",null,{"$f":"IF('Reçete Dizayn-renkli'!L1=\"\",\"\",'Reçete Dizayn-renkli'!L1)","v":""},{"$f":"'Reçete Dizayn-renkli'!M1","v":0}]
[]
[null,"Beton Sınıfı",{"$f":"IF('Reçete Dizayn-renkli'!B3=\"\",\"\",'Reçete Dizayn-renkli'!B3)","v":"C30/37"},{"$f":"IF(C4<Sheet4!I4,\"DEĞİŞTİR\",\"\")","v":""},"Çev. Etki Sınıfı",null,{"$f":"IF('Reçete Dizayn-renkli'!F3=\"\",\"\",'Reçete Dizayn-renkli'!F3)","v":"XC2"},{"$f":"IF(C4<Sheet4!I4,Sheet4!I9,\"\")","v":""},null,null,"Klorür Sınıfı",null,{"$f":"'Reçete Dizayn-renkli'!L3","v":""},{"$f":"'Reçete Dizayn-renkli'!M3","v":0}]
[null,"Çimento Sınıfı",{"$f":"IF('Reçete Dizayn-renkli'!B4=\"\",\"\",'Reçete Dizayn-renkli'!B4)","v":"CEM I"},null,"Min.Katkı k değeri",null,{"$f":"IF('Reçete Dizayn-renkli'!F4=\"\",\"\",'Reçete Dizayn-renkli'!F4)","v":0.4},null,null,null,"Alkali Miktarı(kg/m3)",null,{"$f":"'Reçete Dizayn-renkli'!L4","v":""},{"$f":"'Reçete Dizayn-renkli'!M4","v":0}]
[]
[null,"AGREGA GRADASYON HESAPLAMASI",null,null,null,null,null,null,null,null,"BİLEŞEN ÖZELLİKLERİ"]
[null,"ELEK EBATI","ELEKTEN GEÇEN MALZEME (%)",null,null,null,null,null,"KARIŞIM",null,"Bileşen","Öz.Ağırlık","Cl(%)","Alkali(%)"]
[null,"( mm )","1 NO","2 NO","T.TOZU","D.KUM","K.KUM","G.D.AGR.",null,null,"1 NO",{"$f":"IF('Reçete Dizayn-renkli'!K8=\"\",\"\",'Reçete Dizayn-renkli'!K8)","v":2.7},{"$f":"IF('Reçete Dizayn-renkli'!L8=\"\",\"\",'Reçete Dizayn-renkli'!L8)","v":""},{"$f":"IF('Reçete Dizayn-renkli'!M8=\"\",\"\",'Reçete Dizayn-renkli'!M8)","v":""}]
[null,31.5,{"$f":"IF('Reçete Dizayn-renkli'!B9=\"\",\"\",'Reçete Dizayn-renkli'!B9)","v":100},{"$f":"IF('Reçete Dizayn-renkli'!C9=\"\",\"\",'Reçete Dizayn-renkli'!C9)","v":100},{"$f":"IF('Reçete Dizayn-renkli'!D9=\"\",\"\",'Reçete Dizayn-renkli'!D9)","v":100},{"$f":"IF('Reçete Dizayn-renkli'!E9=\"\",\"\",'Reçete Dizayn-renkli'!E9)","v":100},{"$f":"IF('Reçete Dizayn-renkli'!F9=\"\",\"\",'Reçete Dizayn-renkli'!F9)","v":""},{"$f":"IF('Reçete Dizayn-renkli'!G9=\"\",\"\",'Reçete Dizayn-renkli'!G9)","v":""},{"$f":"IF('Reçete Dizayn-renkli'!H9=\"\",\"\",'Reçete Dizayn-renkli'!H9)","v":100},null,"2 NO",{"$f":"IF('Reçete Dizayn-renkli'!K9=\"\",\"\",'Reçete Dizayn-renkli'!K9)","v":2.7},{"$f":"IF('Reçete Dizayn-renkli'!L9=\"\",\"\",'Reçete Dizayn-renkli'!L9)","v":""},{"$f":"IF('Reçete Dizayn-renkli'!M9=\"\",\"\",'Reçete Dizayn-renkli'!M9)","v":""}]
[null,22.4,{"$f":"IF('Reçete Dizayn-renkli'!B10=\"\",\"\",'Reçete Dizayn-renkli'!B10)","v":100},{"$f":"IF('Reçete Dizayn-renkli'!C10=\"\",\"\",'Reçete Dizayn-renkli'!C10)","v":82.166666666666657},{"$f":"IF('Reçete Dizayn-renkli'!D10=\"\",\"\",'Reçete Dizayn-renkli'!D10)","v":100},{"$f":"IF('Reçete Dizayn-renkli'!E10=\"\",\"\",'Reçete Dizayn-renkli'!E10)","v":100},{"$f":"IF('Reçete Dizayn-renkli'!F10=\"\",\"\",'Reçete Dizayn-renkli'!F10)","v":""},{"$f":"IF('Reçete Dizayn-renkli'!G10=\"\",\"\",'Reçete Dizayn-renkli'!G10)","v":""},{"$f":"IF('Reçete Dizayn-renkli'!H10=\"\",\"\",'Reçete Dizayn-renkli'!H10)","v":96.433333333333323},null,"T.TOZU",{"$f":"IF('Reçete Dizayn-renkli'!K10=\"\",\"\",'Reçete Dizayn-renkli'!K10)","v":2.69},{"$f":"IF('Reçete Dizayn-renkli'!L10=\"\",\"\",'Reçete Dizayn-renkli'!L10)","v":""},{"$f":"IF('Reçete Dizayn-renkli'!M10=\"\",\"\",'Reçete Dizayn-renkli'!M10)","v":""}]
[null,19,{"$f":"IF('Reçete Dizayn-renkli'!B11=\"\",\"\",'Reçete Dizayn-renkli'!B11)","v":100},{"$f":"IF('Reçete Dizayn-renkli'!C11=\"\",\"\",'Reçete Dizayn-renkli'!C11)","v":48.966666666666669},{"$f":"IF('Reçete Dizayn-renkli'!D11=\"\",\"\",'Reçete Dizayn-renkli'!D11)","v":100},{"$f":"IF('Reçete Dizayn-renkli'!E11=\"\",\"\",'Reçete Dizayn-renkli'!E11)","v":100},{"$f":"IF('Reçete Dizayn-renkli'!F11=\"\",\"\",'Reçete Dizayn-renkli'!F11)","v":""},{"$f":"IF('Reçete Dizayn-renkli'!G11=\"\",\"\",'Reçete Dizayn-renkli'!G11)","v":""},{"$f":"IF('Reçete Dizayn-renkli'!H11=\"\",\"\",'Reçete Dizayn-renkli'!H11)","v":89.793333333333337},null,"D.KUM",{"$f":"IF('Reçete Dizayn-renkli'!K11=\"\",\"\",'Reçete Dizayn-renkli'!K11)","v":2.62},{"$f":"IF('Reçete Dizayn-renkli'!L11=\"\",\"\",'Reçete Dizayn-renkli'!L11)","v":""},{"$f":"IF('Reçete Dizayn-renkli'!M11=\"\",\"\",'Reçete Dizayn-renkli'!M11)","v":""}]
[null,16,{"$f":"IF('Reçete Dizayn-renkli'!B12=\"\",\"\",'Reçete Dizayn-renkli'!B12)","v":98},{"$f":"IF('Reçete Dizayn-renkli'!C12=\"\",\"\",'Reçete Dizayn-renkli'!C12)","v":21.666666666666671},{"$f":"IF('Reçete Dizayn-renkli'!D12=\"\",\"\",'Reçete Dizayn-renkli'!D12)","v":100},{"$f":"IF('Reçete Dizayn-renkli'!E12=\"\",\"\",'Reçete Dizayn-renkli'!E12)","v":100},{"$f":"IF('Reçete Dizayn-renkli'!F12=\"\",\"\",'Reçete Dizayn-renkli'!F12)","v":""},{"$f":"IF('Reçete Dizayn-renkli'!G12=\"\",\"\",'Reçete Dizayn-renkli'!G12)","v":""},{"$f":"IF('Reçete Dizayn-renkli'!H12=\"\",\"\",'Reçete Dizayn-renkli'!H12)","v":83.833333333333343},null,"K.KUM",{"$f":"IF('Reçete Dizayn-renkli'!K12=\"\",\"\",'Reçete Dizayn-renkli'!K12)","v":2.61},{"$f":"IF('Reçete Dizayn-renkli'!L12=\"\",\"\",'Reçete Dizayn-renkli'!L12)","v":""},{"$f":"IF('Reçete Dizayn-renkli'!M12=\"\",\"\",'Reçete Dizayn-renkli'!M12)","v":""}]
[null,11.2,{"$f":"IF('Reçete Dizayn-renkli'!B13=\"\",\"\",'Reçete Dizayn-renkli'!B13)","v":54.633333333333333},{"$f":"IF('Reçete Dizayn-renkli'!C13=\"\",\"\",'Reçete Dizayn-renkli'!C13)","v":0.96666666666666856},{"$f":"IF('Reçete Dizayn-renkli'!D13=\"\",\"\",'Reçete Dizayn-renkli'!D13)","v":100},{"$f":"IF('Reçete Dizayn-renkli'!E13=\"\",\"\",'Reçete Dizayn-renkli'!E13)","v":100},{"$f":"IF('Reçete Dizayn-renkli'!F13=\"\",\"\",'Reçete Dizayn-renkli'!F13)","v":""},{"$f":"IF('Reçete Dizayn-renkli'!G13=\"\",\"\",'Reçete Dizayn-renkli'!G13)","v":""},{"$f":"IF('Reçete Dizayn-renkli'!H13=\"\",\"\",'Reçete Dizayn-renkli'!H13)","v":68.851666666666659},null,"G.D.AGR.",{"$f":"IF('Reçete Dizayn-renkli'!K13=\"\",\"\",'Reçete Dizayn-renkli'!K13)","v":""},{"$f":"IF('Reçete Dizayn-renkli'!L13=\"\",\"\",'Reçete Dizayn-renkli'!L13)","v":""},{"$f":"IF('Reçete Dizayn-renkli'!M13=\"\",\"\",'Reçete Dizayn-renkli'!M13)","v":""}]
[null,8,{"$f":"IF('Reçete Dizayn-renkli'!B14=\"\",\"\",'Reçete Dizayn-renkli'!B14)","v":11},{"$f":"IF('Reçete Dizayn-renkli'!C14=\"\",\"\",'Reçete Dizayn-renkli'!C14)","v":0.3333333333333286},{"$f":"IF('Reçete Dizayn-renkli'!D14=\"\",\"\",'Reçete Dizayn-renkli'!D14)","v":100},{"$f":"IF('Reçete Dizayn-renkli'!E14=\"\",\"\",'Reçete Dizayn-renkli'!E14)","v":100},{"$f":"IF('Reçete Dizayn-renkli'!F14=\"\",\"\",'Reçete Dizayn-renkli'!F14)","v":""},{"$f":"IF('Reçete Dizayn-renkli'!G14=\"\",\"\",'Reçete Dizayn-renkli'!G14)","v":""},{"$f":"IF('Reçete Dizayn-renkli'!H14=\"\",\"\",'Reçete Dizayn-renkli'!H14)","v":57.816666666666663},null,"ÇİMENTO 1",{"$f":"IF('Reçete Dizayn-renkli'!K14=\"\",\"\",'Reçete Dizayn-renkli'!K14)","v":3.1},{"$f":"IF('Reçete Dizayn-renkli'!L14=\"\",\"\",'Reçete Dizayn-renkli'!L14)","v":""},{"$f":"IF('Reçete Dizayn-renkli'!M14=\"\",\"\",'Reçete Dizayn-renkli'!M14)","v":""}]
[null,5.6,{"$f":"IF('Reçete Dizayn-renkli'!B15=\"\",\"\",'Reçete Dizayn-renkli'!B15)","v":2.0666666666666771},{"$f":"IF('Reçete Dizayn-renkli'!C15=\"\",\"\",'Reçete Dizayn-renkli'!C15)","v":0.3333333333333286},{"$f":"IF('Reçete Dizayn-renkli'!D15=\"\",\"\",'Reçete Dizayn-renkli'!D15)","v":95.6},{"$f":"IF('Reçete Dizayn-renkli'!E15=\"\",\"\",'Reçete Dizayn-renkli'!E15)","v":100},{"$f":"IF('Reçete Dizayn-renkli'!F15=\"\",\"\",'Reçete Dizayn-renkli'!F15)","v":""},{"$f":"IF('Reçete Dizayn-renkli'!G15=\"\",\"\",'Reçete Dizayn-renkli'!G15)","v":""},{"$f":"IF('Reçete Dizayn-renkli'!H15=\"\",\"\",'Reçete Dizayn-renkli'!H15)","v":54.483333333333341},null,"ÇİMENTO 2",{"$f":"IF('Reçete Dizayn-renkli'!K15=\"\",\"\",'Reçete Dizayn-renkli'!K15)","v":3.04},{"$f":"IF('Reçete Dizayn-renkli'!L15=\"\",\"\",'Reçete Dizayn-renkli'!L15)","v":""},{"$f":"IF('Reçete Dizayn-renkli'!M15=\"\",\"\",'Reçete Dizayn-renkli'!M15)","v":""}]
[null,4,{"$f":"IF('Reçete Dizayn-renkli'!B16=\"\",\"\",'Reçete Dizayn-renkli'!B16)","v":0.3333333333333286},{"$f":"IF('Reçete Dizayn-renkli'!C16=\"\",\"\",'Reçete Dizayn-renkli'!C16)","v":0.3333333333333286},{"$f":"IF('Reçete Dizayn-renkli'!D16=\"\",\"\",'Reçete Dizayn-renkli'!D16)","v":77.7},{"$f":"IF('Reçete Dizayn-renkli'!E16=\"\",\"\",'Reçete Dizayn-renkli'!E16)","v":90},{"$f":"IF('Reçete Dizayn-renkli'!F16=\"\",\"\",'Reçete Dizayn-renkli'!F16)","v":""},{"$f":"IF('Reçete Dizayn-renkli'!G16=\"\",\"\",'Reçete Dizayn-renkli'!G16)","v":""},{"$f":"IF('Reçete Dizayn-renkli'!H16=\"\",\"\",'Reçete Dizayn-renkli'!H16)","v":46.575000000000003},null,"SU",{"$f":"IF('Reçete Dizayn-renkli'!K16=\"\",\"\",'Reçete Dizayn-renkli'!K16)","v":1},{"$f":"IF('Reçete Dizayn-renkli'!L16=\"\",\"\",'Reçete Dizayn-renkli'!L16)","v":""},{"$f":"IF('Reçete Dizayn-renkli'!M16=\"\",\"\",'Reçete Dizayn-renkli'!M16)","v":""}]
[null,2,{"$f":"IF('Reçete Dizayn-renkli'!B17=\"\",\"\",'Reçete Dizayn-renkli'!B17)","v":0.26666666666666572},{"$f":"IF('Reçete Dizayn-renkli'!C17=\"\",\"\",'Reçete Dizayn-renkli'!C17)","v":0.20000000000000284},{"$f":"IF('Reçete Dizayn-renkli'!D17=\"\",\"\",'Reçete Dizayn-renkli'!D17)","v":55.9},{"$f":"IF('Reçete Dizayn-renkli'!E17=\"\",\"\",'Reçete Dizayn-renkli'!E17)","v":51},{"$f":"IF('Reçete Dizayn-renkli'!F17=\"\",\"\",'Reçete Dizayn-renkli'!F17)","v":""},{"$f":"IF('Reçete Dizayn-renkli'!G17=\"\",\"\",'Reçete Dizayn-renkli'!G17)","v":""},{"$f":"IF('Reçete Dizayn-renkli'!H17=\"\",\"\",'Reçete Dizayn-renkli'!H17)","v":29.381666666666671},null,"G.D.SU",{"$f":"IF('Reçete Dizayn-renkli'!K17=\"\",\"\",'Reçete Dizayn-renkli'!K17)","v":1.03},{"$f":"IF('Reçete Dizayn-renkli'!L17=\"\",\"\",'Reçete Dizayn-renkli'!L17)","v":""},{"$f":"IF('Reçete Dizayn-renkli'!M17=\"\",\"\",'Reçete Dizayn-renkli'!M17)","v":""}]
[null,1,{"$f":"IF('Reçete Dizayn-renkli'!B18=\"\",\"\",'Reçete Dizayn-renkli'!B18)","v":0.26666666666666572},{"$f":"IF('Reçete Dizayn-renkli'!C18=\"\",\"\",'Reçete Dizayn-renkli'!C18)","v":0.20000000000000284},{"$f":"IF('Reçete Dizayn-renkli'!D18=\"\",\"\",'Reçete Dizayn-renkli'!D18)","v":39.200000000000003},{"$f":"IF('Reçete Dizayn-renkli'!E18=\"\",\"\",'Reçete Dizayn-renkli'!E18)","v":35},{"$f":"IF('Reçete Dizayn-renkli'!F18=\"\",\"\",'Reçete Dizayn-renkli'!F18)","v":""},{"$f":"IF('Reçete Dizayn-renkli'!G18=\"\",\"\",'Reçete Dizayn-renkli'!G18)","v":""},{"$f":"IF('Reçete Dizayn-renkli'!H18=\"\",\"\",'Reçete Dizayn-renkli'!H18)","v":20.40666666666667},null,"UÇUCU KÜL",{"$f":"IF('Reçete Dizayn-renkli'!K18=\"\",\"\",'Reçete Dizayn-renkli'!K18)","v":2.5},{"$f":"IF('Reçete Dizayn-renkli'!L18=\"\",\"\",'Reçete Dizayn-renkli'!L18)","v":""},{"$f":"IF('Reçete Dizayn-renkli'!M18=\"\",\"\",'Reçete Dizayn-renkli'!M18)","v":""}]
[null,0.5,{"$f":"IF('Reçete Dizayn-renkli'!B19=\"\",\"\",'Reçete Dizayn-renkli'!B19)","v":0.26666666666666572},{"$f":"IF('Reçete Dizayn-renkli'!C19=\"\",\"\",'Reçete Dizayn-renkli'!C19)","v":0.20000000000000284},{"$f":"IF('Reçete Dizayn-renkli'!D19=\"\",\"\",'Reçete Dizayn-renkli'!D19)","v":23.8},{"$f":"IF('Reçete Dizayn-renkli'!E19=\"\",\"\",'Reçete Dizayn-renkli'!E19)","v":26},{"$f":"IF('Reçete Dizayn-renkli'!F19=\"\",\"\",'Reçete Dizayn-renkli'!F19)","v":""},{"$f":"IF('Reçete Dizayn-renkli'!G19=\"\",\"\",'Reçete Dizayn-renkli'!G19)","v":""},{"$f":"IF('Reçete Dizayn-renkli'!H19=\"\",\"\",'Reçete Dizayn-renkli'!H19)","v":13.856666666666667},null,"S. DUMANI",{"$f":"IF('Reçete Dizayn-renkli'!K19=\"\",\"\",'Reçete Dizayn-renkli'!K19)","v":""},{"$f":"IF('Reçete Dizayn-renkli'!L19=\"\",\"\",'Reçete Dizayn-renkli'!L19)","v":""},{"$f":"IF('Reçete Dizayn-renkli'!M19=\"\",\"\",'Reçete Dizayn-renkli'!M19)","v":""}]
[null,0.25,{"$f":"IF('Reçete Dizayn-renkli'!B20=\"\",\"\",'Reçete Dizayn-renkli'!B20)","v":0.26666666666666572},{"$f":"IF('Reçete Dizayn-renkli'!C20=\"\",\"\",'Reçete Dizayn-renkli'!C20)","v":0.20000000000000284},{"$f":"IF('Reçete Dizayn-renkli'!D20=\"\",\"\",'Reçete Dizayn-renkli'!D20)","v":11.8},{"$f":"IF('Reçete Dizayn-renkli'!E20=\"\",\"\",'Reçete Dizayn-renkli'!E20)","v":20},{"$f":"IF('Reçete Dizayn-renkli'!F20=\"\",\"\",'Reçete Dizayn-renkli'!F20)","v":""},{"$f":"IF('Reçete Dizayn-renkli'!G20=\"\",\"\",'Reçete Dizayn-renkli'!G20)","v":""},{"$f":"IF('Reçete Dizayn-renkli'!H20=\"\",\"\",'Reçete Dizayn-renkli'!H20)","v":9.0566666666666666},null,"KİM. KATKI 1",{"$f":"IF('Reçete Dizayn-renkli'!K20=\"\",\"\",'Reçete Dizayn-renkli'!K20)","v":1.1000000000000001},{"$f":"IF('Reçete Dizayn-renkli'!L20=\"\",\"\",'Reçete Dizayn-renkli'!L20)","v":""},{"$f":"IF('Reçete Dizayn-renkli'!M20=\"\",\"\",'Reçete Dizayn-renkli'!M20)","v":""}]
[null,0.125,{"$f":"IF('Reçete Dizayn-renkli'!B21=\"\",\"\",'Reçete Dizayn-renkli'!B21)","v":0.1},{"$f":"IF('Reçete Dizayn-renkli'!C21=\"\",\"\",'Reçete Dizayn-renkli'!C21)","v":0.1},{"$f":"IF('Reçete Dizayn-renkli'!D21=\"\",\"\",'Reçete Dizayn-renkli'!D21)","v":7},{"$f":"IF('Reçete Dizayn-renkli'!E21=\"\",\"\",'Reçete Dizayn-renkli'!E21)","v":14},{"$f":"IF('Reçete Dizayn-renkli'!F21=\"\",\"\",'Reçete Dizayn-renkli'!F21)","v":""},{"$f":"IF('Reçete Dizayn-renkli'!G21=\"\",\"\",'Reçete Dizayn-renkli'!G21)","v":""},{"$f":"IF('Reçete Dizayn-renkli'!H21=\"\",\"\",'Reçete Dizayn-renkli'!H21)","v":5.9950000000000001},1,"KİM. KATKI 2 ",{"$f":"IF('Reçete Dizayn-renkli'!K21=\"\",\"\",'Reçete Dizayn-renkli'!K21)","v":""},{"$f":"IF('Reçete Dizayn-renkli'!L21=\"\",\"\",'Reçete Dizayn-renkli'!L21)","v":""},{"$f":"IF('Reçete Dizayn-renkli'!M21=\"\",\"\",'Reçete Dizayn-renkli'!M21)","v":""}]
[null,6.3E-2,{"$f":"IF('Reçete Dizayn-renkli'!B22=\"\",\"\",'Reçete Dizayn-renkli'!B22)","v":0},{"$f":"IF('Reçete Dizayn-renkli'!C22=\"\",\"\",'Reçete Dizayn-renkli'!C22)","v":0},{"$f":"IF('Reçete Dizayn-renkli'!D22=\"\",\"\",'Reçete Dizayn-renkli'!D22)","v":2},{"$f":"IF('Reçete Dizayn-renkli'!E22=\"\",\"\",'Reçete Dizayn-renkli'!E22)","v":3},{"$f":"IF('Reçete Dizayn-renkli'!F22=\"\",\"\",'Reçete Dizayn-renkli'!F22)","v":""},{"$f":"IF('Reçete Dizayn-renkli'!G22=\"\",\"\",'Reçete Dizayn-renkli'!G22)","v":""},{"$f":"IF('Reçete Dizayn-renkli'!H22=\"\",\"\",'Reçete Dizayn-renkli'!H22)","v":1.4},null,{"$f":"IF(L25>Sheet4!H4,\"SU/ÇİMENTO DÜZELT\",\"\")","v":""},null,null,{"$f":"IF(L25>Sheet4!H4,Sheet4!H9,\"\")","v":""}]
[null,"MİKTAR(%)",{"$f":"IF('Reçete Dizayn-renkli'!B23=\"\",\"\",'Reçete Dizayn-renkli'!B23)","v":25},{"$f":"IF('Reçete Dizayn-renkli'!C23=\"\",\"\",'Reçete Dizayn-renkli'!C23)","v":20},{"$f":"IF('Reçete Dizayn-renkli'!D23=\"\",\"\",'Reçete Dizayn-renkli'!D23)","v":25},{"$f":"IF('Reçete Dizayn-renkli'!E23=\"\",\"\",'Reçete Dizayn-renkli'!E23)","v":30},{"$f":"IF('Reçete Dizayn-renkli'!F23=\"\",\"\",'Reçete Dizayn-renkli'!F23)","v":0},{"$f":"IF('Reçete Dizayn-renkli'!G23=\"\",\"\",'Reçete Dizayn-renkli'!G23)","v":0},{"$f":"IF('Reçete Dizayn-renkli'!H23=\"\",\"\",'Reçete Dizayn-renkli'!H23)","v":100}]
[null,null,{"$f":"IF('Reçete Dizayn-renkli'!B24=\"\",\"\",'Reçete Dizayn-renkli'!B24)","v":""},{"$f":"IF('Reçete Dizayn-renkli'!C24=\"\",\"\",'Reçete Dizayn-renkli'!C24)","v":""},{"$f":"IF('Reçete Dizayn-renkli'!D24=\"\",\"\",'Reçete Dizayn-renkli'!D24)","v":""},{"$f":"IF('Reçete Dizayn-renkli'!E24=\"\",\"\",'Reçete Dizayn-renkli'!E24)","v":""},{"$f":"IF('Reçete Dizayn-renkli'!F24=\"\",\"\",'Reçete Dizayn-renkli'!F24)","v":""},{"$f":"IF('Reçete Dizayn-renkli'!G24=\"\",\"\",'Reçete Dizayn-renkli'!G24)","v":""},{"$f":"IF('Reçete Dizayn-renkli'!H24=\"\",\"\",'Reçete Dizayn-renkli'!H24)","v":""},null,"Su/Çimento",{"$f":"'Reçete Dizayn-renkli'!K24","v":0.57999999999999996},"Su(kg)",{"$f":"'Reçete Dizayn-renkli'!M24","v":176.32}]
[null,"İncelik Modülü",{"$f":"IF('Reçete Dizayn-renkli'!B25=\"\",\"\",'Reçete Dizayn-renkli'!B25)","v":5.9850000000000003},{"$f":"IF('Reçete Dizayn-renkli'!C25=\"\",\"\",'Reçete Dizayn-renkli'!C25)","v":5.9876666666666667},{"$f":"IF('Reçete Dizayn-renkli'!D25=\"\",\"\",'Reçete Dizayn-renkli'!D25)","v":3.8459999999999996},{"$f":"IF('Reçete Dizayn-renkli'!E25=\"\",\"\",'Reçete Dizayn-renkli'!E25)","v":3.64},{"$f":"IF('Reçete Dizayn-renkli'!F25=\"\",\"\",'Reçete Dizayn-renkli'!F25)","v":""},{"$f":"IF('Reçete Dizayn-renkli'!G25=\"\",\"\",'Reçete Dizayn-renkli'!G25)","v":""},{"$f":"IF('Reçete Dizayn-renkli'!H25=\"\",\"\",'Reçete Dizayn-renkli'!H25)","v":4.7472833333333329}]
[null,6.3E-2]
[null,0.125,{"$f":"'Reçete Dizayn-renkli'!B27","v":2.5},{"$f":"IF($J$22=1,Sheet8!D4,Sheet8!H4)","v":8.5},{"$f":"IF($J$22=1,Sheet8!E4,Sheet8!I4)","v":5.5},{"$f":"$I$22","v":5.9950000000000001}]
[null,0.25,null,{"$f":"IF($J$22=1,Sheet8!D5,Sheet8!H5)","v":15},{"$f":"IF($J$22=1,Sheet8!E5,Sheet8!I5)","v":10.5},{"$f":"$I$21","v":9.0566666666666666},null,null,null,null,"Kompasite",null,{"$f":"IF('Reçete Dizayn-renkli'!L28=\"\",\"\",'Reçete Dizayn-renkli'!L28)","v":0.78959447885689149},{"$f":"IF('Reçete Dizayn-renkli'!M28=\"\",\"\",'Reçete Dizayn-renkli'!M28)","v":""}]
[null,0.5,null,{"$f":"IF($J$22=1,Sheet8!D6,Sheet8!H6)","v":22},{"$f":"IF($J$22=1,Sheet8!E6,Sheet8!I6)","v":16},{"$f":"$I$20","v":13.856666666666667}]
[null,1,{"$f":"IF($J$22=1,Sheet8!C7,Sheet8!G7)","v":16},{"$f":"IF($J$22=1,Sheet8!D7,Sheet8!H7)","v":32},{"$f":"IF($J$22=1,Sheet8!E7,Sheet8!I7)","v":24},{"$f":"$I$19","v":20.40666666666667},null,null,null,null,"DÜZELTİLMİŞ REÇETE (1 m3)",null,null,{"$f":"IF('Reçete Dizayn-renkli'!M30=\"\",\"\",'Reçete Dizayn-renkli'!M30)","v":7}]
[null,2,{"$f":"IF($J$22=1,Sheet8!C8,Sheet8!G8)","v":25},{"$f":"IF($J$22=1,Sheet8!D8,Sheet8!H8)","v":43},{"$f":"IF($J$22=1,Sheet8!E8,Sheet8!I8)","v":34},{"$f":"$I$18","v":29.381666666666671},null,null,null,null,"Bileşen","Ağırlık (kg)","Hacim (dm3)","Ağırlık (kg)"]
[null,4,{"$f":"IF($J$22=1,Sheet8!C9,Sheet8!G9)","v":37},{"$f":"IF($J$22=1,Sheet8!D9,Sheet8!H9)","v":56},{"$f":"IF($J$22=1,Sheet8!E9,Sheet8!I9)","v":46.5},{"$f":"$I$17","v":46.575000000000003}]
[null,5.6,{"$f":"IF($J$22=1,Sheet8!C10,Sheet8!G10)","v":46},{"$f":"IF($J$22=1,Sheet8!D10,Sheet8!H10)","v":64},{"$f":"IF($J$22=1,Sheet8!E10,Sheet8!I10)","v":55},{"$f":"$I$16","v":54.483333333333341},null,null,null,null,{"$f":"$K$9","v":"1 NO"},{"$f":"IF('Reçete Dizayn-renkli'!K33=\"\",\"\",'Reçete Dizayn-renkli'!K33)","v":462.55489442815258},{"$f":"IF('Reçete Dizayn-renkli'!L33=\"\",\"\",'Reçete Dizayn-renkli'!L33)","v":171.31662756598243},{"$f":"IF('Reçete Dizayn-renkli'!M33=\"\",\"\",'Reçete Dizayn-renkli'!M33)","v":3237.8842609970679}]
[null,8,{"$f":"IF($J$22=1,Sheet8!C11,Sheet8!G11)","v":54},{"$f":"IF($J$22=1,Sheet8!D11,Sheet8!H11)","v":71},{"$f":"IF($J$22=1,Sheet8!E11,Sheet8!I11)","v":62.5},{"$f":"$I$15","v":57.816666666666663},null,null,null,null,{"$f":"$K$10","v":"2 NO"},{"$f":"IF('Reçete Dizayn-renkli'!K34=\"\",\"\",'Reçete Dizayn-renkli'!K34)","v":370.04391554252197},{"$f":"IF('Reçete Dizayn-renkli'!L34=\"\",\"\",'Reçete Dizayn-renkli'!L34)","v":137.05330205278591},{"$f":"IF('Reçete Dizayn-renkli'!M34=\"\",\"\",'Reçete Dizayn-renkli'!M34)","v":2590.3074087976538}]
[null,11.2,{"$f":"IF($J$22=1,Sheet8!C12,Sheet8!G12)","v":63.5},{"$f":"IF($J$22=1,Sheet8!D12,Sheet8!H12)","v":79},{"$f":"IF($J$22=1,Sheet8!E12,Sheet8!I12)","v":71.25},{"$f":"$I$14","v":68.851666666666659},null,null,null,null,{"$f":"$K$11","v":"T.TOZU"},{"$f":"IF('Reçete Dizayn-renkli'!K35=\"\",\"\",'Reçete Dizayn-renkli'!K35)","v":456.23331087096784},{"$f":"IF('Reçete Dizayn-renkli'!L35=\"\",\"\",'Reçete Dizayn-renkli'!L35)","v":166.70821028445749},{"$f":"IF('Reçete Dizayn-renkli'!M35=\"\",\"\",'Reçete Dizayn-renkli'!M35)","v":3193.6331760967751}]
[null,16,{"$f":"IF($J$22=1,Sheet8!C13,Sheet8!G13)","v":73},{"$f":"IF($J$22=1,Sheet8!D13,Sheet8!H13)","v":86},{"$f":"IF($J$22=1,Sheet8!E13,Sheet8!I13)","v":79.5},{"$f":"$I$13","v":83.833333333333343},null,null,null,null,{"$f":"$K$12","v":"D.KUM"},{"$f":"IF('Reçete Dizayn-renkli'!K36=\"\",\"\",'Reçete Dizayn-renkli'!K36)","v":533.23328229677429},{"$f":"IF('Reçete Dizayn-renkli'!L36=\"\",\"\",'Reçete Dizayn-renkli'!L36)","v":200.19375830850441},{"$f":"IF('Reçete Dizayn-renkli'!M36=\"\",\"\",'Reçete Dizayn-renkli'!M36)","v":3732.6329760774202}]
[null,19,{"$f":"IF($J$22=1,Sheet8!C14,Sheet8!G14)","v":80.5},{"$f":"IF($J$22=1,Sheet8!D14,Sheet8!H14)","v":91},{"$f":"IF($J$22=1,Sheet8!E14,Sheet8!I14)","v":85.75},{"$f":"$I$12","v":89.793333333333337},null,null,null,null,{"$f":"$K$13","v":"K.KUM"},{"$f":"IF('Reçete Dizayn-renkli'!K37=\"\",\"\",'Reçete Dizayn-renkli'!K37)","v":0},{"$f":"IF('Reçete Dizayn-renkli'!L37=\"\",\"\",'Reçete Dizayn-renkli'!L37)","v":""},{"$f":"IF('Reçete Dizayn-renkli'!M37=\"\",\"\",'Reçete Dizayn-renkli'!M37)","v":0}]
[null,22.4,{"$f":"IF($J$22=1,Sheet8!C15,Sheet8!G15)","v":89},{"$f":"IF($J$22=1,Sheet8!D15,Sheet8!H15)","v":96},{"$f":"IF($J$22=1,Sheet8!E15,Sheet8!I15)","v":92.5},{"$f":"$I$11","v":96.433333333333323},null,null,null,null,{"$f":"$K$14","v":"G.D.AGR."},{"$f":"IF('Reçete Dizayn-renkli'!K38=\"\",\"\",'Reçete Dizayn-renkli'!K38)","v":0},{"$f":"IF('Reçete Dizayn-renkli'!L38=\"\",\"\",'Reçete Dizayn-renkli'!L38)","v":""},{"$f":"IF('Reçete Dizayn-renkli'!M38=\"\",\"\",'Reçete Dizayn-renkli'!M38)","v":0}]
[null,31.5,{"$f":"IF($J$22=1,Sheet8!C16,Sheet8!G16)","v":100},{"$f":"IF($J$22=1,Sheet8!D16,Sheet8!H16)","v":100},{"$f":"IF($J$22=1,Sheet8!E16,Sheet8!I16)","v":100},{"$f":"$I$10","v":100},null,null,null,null,{"$f":"$K$15","v":"ÇİMENTO 1"},{"$f":"IF('Reçete Dizayn-renkli'!K39=\"\",\"\",'Reçete Dizayn-renkli'!K39)","v":280},{"$f":"IF('Reçete Dizayn-renkli'!L39=\"\",\"\",'Reçete Dizayn-renkli'!L39)","v":90.322580645161281},{"$f":"IF('Reçete Dizayn-renkli'!M39=\"\",\"\",'Reçete Dizayn-renkli'!M39)","v":1960}]
[null,"Dmaks",null,null,null,null,null,null,null,null,{"$f":"$K$16","v":"ÇİMENTO 2"},{"$f":"IF('Reçete Dizayn-renkli'!K40=\"\",\"\",'Reçete Dizayn-renkli'!K40)","v":0},{"$f":"IF('Reçete Dizayn-renkli'!L40=\"\",\"\",'Reçete Dizayn-renkli'!L40)","v":0},{"$f":"IF('Reçete Dizayn-renkli'!M40=\"\",\"\",'Reçete Dizayn-renkli'!M40)","v":0}]
[null,"BİLEŞEN MİKTARLARI",null,null,null,null,null,null,null,null,{"$f":"$K$17","v":"SU"},{"$f":"IF('Reçete Dizayn-renkli'!K41=\"\",\"\",'Reçete Dizayn-renkli'!K41)","v":186.31461205219941},{"$f":"IF('Reçete Dizayn-renkli'!L41=\"\",\"\",'Reçete Dizayn-renkli'!L41)","v":186.31461205219941},{"$f":"IF('Reçete Dizayn-renkli'!M41=\"\",\"\",'Reçete Dizayn-renkli'!M41)","v":1304.2022843653958}]
[null,"Bileşen","Ağırlık ","Hacim ",null,"Bileşen","Ağırlık ","Hacim ",null,null,{"$f":"$K$19","v":"UÇUCU KÜL"},{"$f":"IF('Reçete Dizayn-renkli'!K42=\"\",\"\",'Reçete Dizayn-renkli'!K42)","v":60},{"$f":"IF('Reçete Dizayn-renkli'!L42=\"\",\"\",'Reçete Dizayn-renkli'!L42)","v":24},{"$f":"IF('Reçete Dizayn-renkli'!M42=\"\",\"\",'Reçete Dizayn-renkli'!M42)","v":420}]
[null,{"$f":"$K$15","v":"ÇİMENTO 1"},{"$f":"IF('Reçete Dizayn-renkli'!B43=\"\",\"\",'Reçete Dizayn-renkli'!B43)","v":280},{"$f":"IF('Reçete Dizayn-renkli'!C43=\"\",\"\",'Reçete Dizayn-renkli'!C43)","v":90.322580645161281},null,{"$f":"$K$9","v":"1 NO"},{"$f":"IF('Reçete Dizayn-renkli'!F43=\"\",\"\",'Reçete Dizayn-renkli'!F43)","v":462.55489442815258},{"$f":"IF('Reçete Dizayn-renkli'!G43=\"\",\"\",'Reçete Dizayn-renkli'!G43)","v":171.31662756598243},null,null,{"$f":"$K$20","v":"S. DUMANI"},{"$f":"IF('Reçete Dizayn-renkli'!K43=\"\",\"\",'Reçete Dizayn-renkli'!K43)","v":0},{"$f":"IF('Reçete Dizayn-renkli'!L43=\"\",\"\",'Reçete Dizayn-renkli'!L43)","v":""},{"$f":"IF('Reçete Dizayn-renkli'!M43=\"\",\"\",'Reçete Dizayn-renkli'!M43)","v":0}]
[null,{"$f":"$K$16","v":"ÇİMENTO 2"},{"$f":"IF('Reçete Dizayn-renkli'!B44=\"\",\"\",'Reçete Dizayn-renkli'!B44)","v":0},{"$f":"IF('Reçete Dizayn-renkli'!C44=\"\",\"\",'Reçete Dizayn-renkli'!C44)","v":0},null,{"$f":"$K$10","v":"2 NO"},{"$f":"IF('Reçete Dizayn-renkli'!F44=\"\",\"\",'Reçete Dizayn-renkli'!F44)","v":370.04391554252197},{"$f":"IF('Reçete Dizayn-renkli'!G44=\"\",\"\",'Reçete Dizayn-renkli'!G44)","v":137.05330205278591},null,null,{"$f":"$K$21","v":"KİM. KATKI 1"},{"$f":"IF('Reçete Dizayn-renkli'!K44=\"\",\"\",'Reçete Dizayn-renkli'!K44)","v":4.5},{"$f":"IF('Reçete Dizayn-renkli'!L44=\"\",\"\",'Reçete Dizayn-renkli'!L44)","v":4.0909090909090908},{"$f":"IF('Reçete Dizayn-renkli'!M44=\"\",\"\",'Reçete Dizayn-renkli'!M44)","v":31.5}]
[null,{"$f":"$K$19","v":"UÇUCU KÜL"},{"$f":"IF('Reçete Dizayn-renkli'!B45=\"\",\"\",'Reçete Dizayn-renkli'!B45)","v":60},{"$f":"IF('Reçete Dizayn-renkli'!C45=\"\",\"\",'Reçete Dizayn-renkli'!C45)","v":24},null,{"$f":"$K$11","v":"T.TOZU"},{"$f":"IF('Reçete Dizayn-renkli'!F45=\"\",\"\",'Reçete Dizayn-renkli'!F45)","v":460.84172815249275},{"$f":"IF('Reçete Dizayn-renkli'!G45=\"\",\"\",'Reçete Dizayn-renkli'!G45)","v":171.31662756598243},null,null,{"$f":"$K$22","v":"KİM. KATKI 2 "},{"$f":"IF('Reçete Dizayn-renkli'!K45=\"\",\"\",'Reçete Dizayn-renkli'!K45)","v":0},{"$f":"IF('Reçete Dizayn-renkli'!L45=\"\",\"\",'Reçete Dizayn-renkli'!L45)","v":""},{"$f":"IF('Reçete Dizayn-renkli'!M45=\"\",\"\",'Reçete Dizayn-renkli'!M45)","v":0}]
[null,{"$f":"$K$20","v":"S. DUMANI"},{"$f":"IF('Reçete Dizayn-renkli'!B46=\"\",\"\",'Reçete Dizayn-renkli'!B46)","v":0},{"$f":"IF('Reçete Dizayn-renkli'!C46=\"\",\"\",'Reçete Dizayn-renkli'!C46)","v":""},null,{"$f":"$K$12","v":"D.KUM"},{"$f":"IF('Reçete Dizayn-renkli'!F46=\"\",\"\",'Reçete Dizayn-renkli'!F46)","v":538.61947706744877},{"$f":"IF('Reçete Dizayn-renkli'!G46=\"\",\"\",'Reçete Dizayn-renkli'!G46)","v":205.57995307917889},null,null,"TOPLAM",{"$f":"IF('Reçete Dizayn-renkli'!K46=\"\",\"\",'Reçete Dizayn-renkli'!K46)","v":2352.8800151906157},{"$f":"IF('Reçete Dizayn-renkli'!L46=\"\",\"\",'Reçete Dizayn-renkli'!L46)","v":1000.0000000000001},{"$f":"IF('Reçete Dizayn-renkli'!M46=\"\",\"\",'Reçete Dizayn-renkli'!M46)","v":16470.160106334311}]
[null,{"$f":"$K$21","v":"KİM. KATKI 1"},{"$f":"IF('Reçete Dizayn-renkli'!B47=\"\",\"\",'Reçete Dizayn-renkli'!B47)","v":4.5},{"$f":"IF('Reçete Dizayn-renkli'!C47=\"\",\"\",'Reçete Dizayn-renkli'!C47)","v":4.0909090909090908},null,{"$f":"$K$13","v":"K.KUM"},{"$f":"IF('Reçete Dizayn-renkli'!F47=\"\",\"\",'Reçete Dizayn-renkli'!F47)","v":0},{"$f":"IF('Reçete Dizayn-renkli'!G47=\"\",\"\",'Reçete Dizayn-renkli'!G47)","v":0}]
[null,{"$f":"$K$22","v":"KİM. KATKI 2 "},{"$f":"IF('Reçete Dizayn-renkli'!B48=\"\",\"\",'Reçete Dizayn-renkli'!B48)","v":0},{"$f":"IF('Reçete Dizayn-renkli'!C48=\"\",\"\",'Reçete Dizayn-renkli'!C48)","v":""},null,{"$f":"$K$14","v":"G.D.AGR."},{"$f":"IF('Reçete Dizayn-renkli'!F48=\"\",\"\",'Reçete Dizayn-renkli'!F48)","v":0},{"$f":"IF('Reçete Dizayn-renkli'!G48=\"\",\"\",'Reçete Dizayn-renkli'!G48)","v":0},null,null,"Birim Ağırlık (kg/m3)",{"$f":"SUM(L34:L46)","v":2352.8800151906157}," Hacim (dm3)",{"$f":"SUM(M34:M46)+D50","v":1000.0000000000001}]
[null,"HAVA",{"$f":"IF('Reçete Dizayn-renkli'!B49=\"\",\"\",'Reçete Dizayn-renkli'!B49)","v":0},{"$f":"IF('Reçete Dizayn-renkli'!C49=\"\",\"\",'Reçete Dizayn-renkli'!C49)","v":20},null,{"$f":"$K$17","v":"SU"},{"$f":"IF('Reçete Dizayn-renkli'!F49=\"\",\"\",'Reçete Dizayn-renkli'!F49)","v":176.32},{"$f":"IF('Reçete Dizayn-renkli'!G49=\"\",\"\",'Reçete Dizayn-renkli'!G49)","v":176.32}]
[null,null,null,null,null,null,null,null,null,null,"Ölçülen Birim Ağırlık",null,{"$f":"IF('Reçete Dizayn-renkli'!L50=\"\",\"\",'Reçete Dizayn-renkli'!L50)","v":""},{"$f":"IF('Reçete Dizayn-renkli'!M50=\"\",\"\",'Reçete Dizayn-renkli'!M50)","v":""}]
[null,"Birim Ağırlık (kg/m3)",null,{"$f":"IF('Reçete Dizayn-renkli'!C51=\"\",\"\",'Reçete Dizayn-renkli'!C51)","v":2352.8800151906166},null," Hacim (dm3)",null,{"$f":"IF('Reçete Dizayn-renkli'!G51=\"\",\"\",'Reçete Dizayn-renkli'!G51)","v":1000},null,null,"Basınç Dayanımı(MPa)",null,"Sıcaklık (oC)"]
[null,"NEM DÜZELTME",null,null,null,null,null,null,{"$f":"'Reçete Dizayn-renkli'!H52:H53","v":0},null,"3 GÜN",{"$f":"IF('Reçete Dizayn-renkli'!K52=\"\",\"\",'Reçete Dizayn-renkli'!K52)","v":""},"Ortam",{"$f":"IF('Reçete Dizayn-renkli'!M52=\"\",\"\",'Reçete Dizayn-renkli'!M52)","v":""}]
[null,null,"1 NO","2 NO","T.TOZU","D.KUM","K.KUM","G.D.AGR.",null,null,"7 GÜN",{"$f":"IF('Reçete Dizayn-renkli'!K53=\"\",\"\",'Reçete Dizayn-renkli'!K53)","v":""},null,{"$f":"IF('Reçete Dizayn-renkli'!M53=\"\",\"\",'Reçete Dizayn-renkli'!M53)","v":""}]
[null,"Nem  (%)",{"$f":"IF('Reçete Dizayn-renkli'!B54=\"\",\"\",'Reçete Dizayn-renkli'!B54)","v":1},{"$f":"IF('Reçete Dizayn-renkli'!C54=\"\",\"\",'Reçete Dizayn-renkli'!C54)","v":1},{"$f":"IF('Reçete Dizayn-renkli'!D54=\"\",\"\",'Reçete Dizayn-renkli'!D54)","v":2},{"$f":"IF('Reçete Dizayn-renkli'!E54=\"\",\"\",'Reçete Dizayn-renkli'!E54)","v":2},{"$f":"IF('Reçete Dizayn-renkli'!F54=\"\",\"\",'Reçete Dizayn-renkli'!F54)","v":""},{"$f":"IF('Reçete Dizayn-renkli'!G54=\"\",\"\",'Reçete Dizayn-renkli'!G54)","v":""},{"$f":"IF('Reçete Dizayn-renkli'!H54=\"\",\"\",'Reçete Dizayn-renkli'!H54)","v":9.9946120521994146},null,"28 GÜN",{"$f":"IF('Reçete Dizayn-renkli'!K54=\"\",\"\",'Reçete Dizayn-renkli'!K54)","v":""},"Beton",{"$f":"IF('Reçete Dizayn-renkli'!M54=\"\",\"\",'Reçete Dizayn-renkli'!M54)","v":""}]
[null,"Su emme (%)",{"$f":"IF('Reçete Dizayn-renkli'!B55=\"\",\"\",'Reçete Dizayn-renkli'!B55)","v":1},{"$f":"IF('Reçete Dizayn-renkli'!C55=\"\",\"\",'Reçete Dizayn-renkli'!C55)","v":1},{"$f":"IF('Reçete Dizayn-renkli'!D55=\"\",\"\",'Reçete Dizayn-renkli'!D55)","v":3},{"$f":"IF('Reçete Dizayn-renkli'!E55=\"\",\"\",'Reçete Dizayn-renkli'!E55)","v":3},{"$f":"IF('Reçete Dizayn-renkli'!F55=\"\",\"\",'Reçete Dizayn-renkli'!F55)","v":""},{"$f":"IF('Reçete Dizayn-renkli'!G55=\"\",\"\",'Reçete Dizayn-renkli'!G55)","v":""},{"$f":"IF('Reçete Dizayn-renkli'!H55=\"\",\"\",'Reçete Dizayn-renkli'!H55)","v":""},null,"Slump(cm)",{"$f":"IF('Reçete Dizayn-renkli'!K55=\"\",\"\",'Reçete Dizayn-renkli'!K55)","v":""},null,{"$f":"IF('Reçete Dizayn-renkli'!M55=\"\",\"\",'Reçete Dizayn-renkli'!M55)","v":""}]

{"sheet":"Diğer","index":10,"n_rows":32,"n_cols":13,"rows_kept":32,"cut":false,"hidden":false,"merged":[[1,7,4,8],[5,7,7,8],[30,5,31,5],[30,6,31,6],[24,1,24,12],[25,1,26,1],[25,2,26,2],[25,3,26,3],[25,4,26,4],[25,5,26,5],[25,6,26,6],[21,9,21,10],[21,11,21,12],[22,9,22,10],[22,11,22,12],[23,9,23,10],[23,11,23,12],[18,9,18,10],[18,11,18,12],[19,9,19,10],[19,11,19,12],[20,9,20,10],[20,11,20,12],[15,9,15,10],[15,11,15,12],[16,9,16,10],[16,11,16,12],[17,9,17,10],[17,11,17,12],[12,9,12,10],[12,11,12,12],[13,9,13,10],[13,11,13,12],[14,9,14,10],[14,11,14,12],[9,9,9,12],[10,1,10,8],[10,9,10,10],[10,11,10,12],[11,9,11,10],[11,11,11,12],[6,9,7,9],[6,10,7,10],[6,11,7,12],[1,9,2,12],[3,11,3,12],[4,9,5,9],[4,10,5,10],[4,11,5,12]]}
[]
[null,null,null,null,null,null,null,"ÇOK İNCE MALZEME MUHTEVASI                    (TS 13515)                         (<0,125mm) (kg)",null,{"$f":"'Reçete Dizayn-renkli'!V25","v":"ÇOK İNCE MALZEME MUHTEVASI                    (EN 12620) ( <0,063mm)"}]
[]
[null,null,null,null,null,null,null,null,null,"Tip","Değer(%)","Sınıf"]
[null,null,null,null,null,null,null,null,null,"İnce Agrega",{"$f":"'Reçete Dizayn-renkli'!W28","v":2.5454545454545454},{"$f":"'Reçete Dizayn-renkli'!X28","v":"f3"},{"$f":"'Reçete Dizayn-renkli'!Y28","v":0}]
[null,null,null,null,null,null,null,{"$f":"'Reçete Dizayn-renkli'!T29","v":449.23282091814804},null,null,{"$f":"'Reçete Dizayn-renkli'!W29","v":0},{"$f":"'Reçete Dizayn-renkli'!X29","v":0},{"$f":"'Reçete Dizayn-renkli'!Y29","v":0}]
[null,null,null,null,null,null,null,null,null,"İri     Agrega",{"$f":"'Reçete Dizayn-renkli'!W30","v":0},{"$f":"'Reçete Dizayn-renkli'!X30","v":"f3"},{"$f":"'Reçete Dizayn-renkli'!Y30","v":0}]
[null,null,null,null,null,null,null,null,null,null,{"$f":"'Reçete Dizayn-renkli'!W31","v":0},{"$f":"'Reçete Dizayn-renkli'!X31","v":0},{"$f":"'Reçete Dizayn-renkli'!Y31","v":0}]
[]
[null,null,null,null,null,null,null,null,null,"Elek Arası Kalan (%)"]
[null,"Pompa ile iletilen betonda kullanılacak ince agrega için tane dağılım eğrileri",null,null,null,null,null,null,null,{"$f":"'Reçete Dizayn-renkli'!V34","v":"31,5-22,4"},{"$f":"'Reçete Dizayn-renkli'!W34","v":0},{"$f":"'Reçete Dizayn-renkli'!X34","v":3.5666666666666771},{"$f":"'Reçete Dizayn-renkli'!Y34","v":0}]
[null,null,6.3E-2,0,3,{"$f":"AVERAGE(D12:E12)","v":1.5},{"$f":"($E$23*#REF!+$F$23*#REF!+$G$23*#REF!)/($E$23+$F$23+$G$23)","v":{"$error":"#REF!"}},null,null,{"$f":"'Reçete Dizayn-renkli'!V35","v":"22,4-19"},{"$f":"'Reçete Dizayn-renkli'!W35","v":0},{"$f":"'Reçete Dizayn-renkli'!X35","v":6.6399999999999864},{"$f":"'Reçete Dizayn-renkli'!Y35","v":0}]
[null,null,0.125,2.5,9,{"$f":"AVERAGE(D13:E13)","v":5.75},{"$f":"($E$23*#REF!+$F$23*#REF!+$G$23*#REF!)/($E$23+$F$23+$G$23)","v":{"$error":"#REF!"}},null,null,{"$f":"'Reçete Dizayn-renkli'!V36","v":"19-16"},{"$f":"'Reçete Dizayn-renkli'!W36","v":0},{"$f":"'Reçete Dizayn-renkli'!X36","v":5.9599999999999937},{"$f":"'Reçete Dizayn-renkli'!Y36","v":0}]
[null,null,0.25,8,25,16.5,{"$f":"($E$23*#REF!+$F$23*#REF!+$G$23*#REF!)/($E$23+$F$23+$G$23)","v":{"$error":"#REF!"}},null,null,{"$f":"'Reçete Dizayn-renkli'!V37","v":"16-11,2"},{"$f":"'Reçete Dizayn-renkli'!W37","v":0},{"$f":"'Reçete Dizayn-renkli'!X37","v":14.981666666666683},{"$f":"'Reçete Dizayn-renkli'!Y37","v":0}]
[null,null,0.5,20,50,35,{"$f":"($E$23*#REF!+$F$23*#REF!+$G$23*#REF!)/($E$23+$F$23+$G$23)","v":{"$error":"#REF!"}},null,null,{"$f":"'Reçete Dizayn-renkli'!V38","v":"11,2-8"},{"$f":"'Reçete Dizayn-renkli'!W38","v":0},{"$f":"'Reçete Dizayn-renkli'!X38","v":11.034999999999997},{"$f":"'Reçete Dizayn-renkli'!Y38","v":0}]
[null,null,1,44,74,59,{"$f":"($E$23*#REF!+$F$23*#REF!+$G$23*#REF!)/($E$23+$F$23+$G$23)","v":{"$error":"#REF!"}},null,null,{"$f":"'Reçete Dizayn-renkli'!V39","v":"8-5,6"},{"$f":"'Reçete Dizayn-renkli'!W39","v":0},{"$f":"'Reçete Dizayn-renkli'!X39","v":3.3333333333333215},{"$f":"'Reçete Dizayn-renkli'!Y39","v":0}]
[null,null,2,69,90,79.5,{"$f":"($E$23*#REF!+$F$23*#REF!+$G$23*#REF!)/($E$23+$F$23+$G$23)","v":{"$error":"#REF!"}},null,null,{"$f":"'Reçete Dizayn-renkli'!V40","v":"5,6-4"},{"$f":"'Reçete Dizayn-renkli'!W40","v":0},{"$f":"'Reçete Dizayn-renkli'!X40","v":7.9083333333333385},{"$f":"'Reçete Dizayn-renkli'!Y40","v":0}]
[null,null,4,85,98,91.5,{"$f":"($E$23*#REF!+$F$23*#REF!+$G$23*#REF!)/($E$23+$F$23+$G$23)","v":{"$error":"#REF!"}},null,null,{"$f":"'Reçete Dizayn-renkli'!V41","v":"4-2"},{"$f":"'Reçete Dizayn-renkli'!W41","v":0},{"$f":"'Reçete Dizayn-renkli'!X41","v":17.193333333333332},{"$f":"'Reçete Dizayn-renkli'!Y41","v":0}]
[null,null,5.6,95,100,97.5,{"$f":"($E$23*#REF!+$F$23*#REF!+$G$23*#REF!)/($E$23+$F$23+$G$23)","v":{"$error":"#REF!"}},null,null,{"$f":"'Reçete Dizayn-renkli'!V42","v":"2-1"},{"$f":"'Reçete Dizayn-renkli'!W42","v":0},{"$f":"'Reçete Dizayn-renkli'!X42","v":8.9750000000000014},{"$f":"'Reçete Dizayn-renkli'!Y42","v":0}]
[null,null,8,100,100,100,{"$f":"($E$23*#REF!+$F$23*#REF!+$G$23*#REF!)/($E$23+$F$23+$G$23)","v":{"$error":"#REF!"}},null,null,{"$f":"'Reçete Dizayn-renkli'!V43","v":"1-0,5"},{"$f":"'Reçete Dizayn-renkli'!W43","v":0},{"$f":"'Reçete Dizayn-renkli'!X43","v":6.5500000000000025},{"$f":"'Reçete Dizayn-renkli'!Y43","v":0}]
[null,null,null,null,null,null,null,null,null,{"$f":"'Reçete Dizayn-renkli'!V44","v":"0,5-0,25"},{"$f":"'Reçete Dizayn-renkli'!W44","v":0},{"$f":"'Reçete Dizayn-renkli'!X44","v":4.8000000000000007},{"$f":"'Reçete Dizayn-renkli'!Y44","v":0}]
[null,null,null,null,null,null,null,null,null,{"$f":"'Reçete Dizayn-renkli'!V45","v":"0,25-0,125"},{"$f":"'Reçete Dizayn-renkli'!W45","v":0},{"$f":"'Reçete Dizayn-renkli'!X45","v":3.0616666666666665},{"$f":"'Reçete Dizayn-renkli'!Y45","v":0}]
[null,null,null,null,null,null,null,null,null,{"$f":"'Reçete Dizayn-renkli'!V46","v":"0,125-0,063"},{"$f":"'Reçete Dizayn-renkli'!W46","v":0},{"$f":"'Reçete Dizayn-renkli'!X46","v":4.5950000000000006},{"$f":"'Reçete Dizayn-renkli'!Y46","v":0}]
[null,null,null,null,null,null,null,null,null,{"$f":"'Reçete Dizayn-renkli'!V47","v":"<0,063"},{"$f":"'Reçete Dizayn-renkli'!W47","v":0},{"$f":"'Reçete Dizayn-renkli'!X47","v":1.4},{"$f":"'Reçete Dizayn-renkli'!Y47","v":0}]
[null,"MALİYET HESABI"]
[null,"Bileşen","Fiyat","Bileşen","Fiyat","Bileşen","Fiyat"]
[null,null,null,null,null,null,null,null,null,null,null,"Toplam",{"$f":"SUM(M28:M32)","v":{"$error":"#REF!"}}]
[null,{"$f":"'Reçete Dizayn-renkli'!N51","v":"ÇİMENTO 1"},{"$f":"'Reçete Dizayn-renkli'!O51","v":0},{"$f":"'Reçete Dizayn-renkli'!P51","v":"1 NO"},{"$f":"'Reçete Dizayn-renkli'!Q51","v":0},{"$f":"'Reçete Dizayn-renkli'!R51","v":"KİM. KATKI 1"},{"$f":"'Reçete Dizayn-renkli'!S51","v":0},null,null,"Çimento",{"$f":"(C28*#REF!+#REF!*C29)/1000","v":{"$error":"#REF!"}},{"$f":"J32","v":"Su"},{"$f":"K32","v":{"$error":"#REF!"}}]
[null,{"$f":"'Reçete Dizayn-renkli'!N52","v":"ÇİMENTO 2"},{"$f":"'Reçete Dizayn-renkli'!O52","v":0},{"$f":"'Reçete Dizayn-renkli'!P52","v":"2 NO"},{"$f":"'Reçete Dizayn-renkli'!Q52","v":0},{"$f":"'Reçete Dizayn-renkli'!R52","v":"KİM. KATKI 2 "},{"$f":"'Reçete Dizayn-renkli'!S52","v":0},null,null,"Mineral Katkı",{"$f":"(#REF!*C30+#REF!*C31)/1000","v":{"$error":"#REF!"}},{"$f":"J30","v":"Kimyasal Katkı"},{"$f":"K30","v":{"$error":"#REF!"}}]
[null,{"$f":"'Reçete Dizayn-renkli'!N53","v":"UÇUCU KÜL"},{"$f":"'Reçete Dizayn-renkli'!O53","v":0},{"$f":"'Reçete Dizayn-renkli'!P53","v":"T.TOZU"},{"$f":"'Reçete Dizayn-renkli'!Q53","v":0},{"$f":"'Reçete Dizayn-renkli'!R53","v":"G.D.AGR."},{"$f":"'Reçete Dizayn-renkli'!S53","v":0},null,null,"Kimyasal Katkı",{"$f":"(#REF!*G28+#REF!*G29)/1000","v":{"$error":"#REF!"}},{"$f":"J29","v":"Mineral Katkı"},{"$f":"K29","v":{"$error":"#REF!"}}]
[null,{"$f":"'Reçete Dizayn-renkli'!N54","v":"S. DUMANI"},{"$f":"'Reçete Dizayn-renkli'!O54","v":0},{"$f":"'Reçete Dizayn-renkli'!P54","v":"D.KUM"},{"$f":"'Reçete Dizayn-renkli'!Q54","v":0},{"$f":"'Reçete Dizayn-renkli'!R54","v":"TOPLAM (TL)"},{"$f":"'Reçete Dizayn-renkli'!S54","v":""},null,null,"Agrega",{"$f":"(E28*#REF!+#REF!*E29+E30*#REF!+#REF!*E31+E32*#REF!)/1000","v":{"$error":"#REF!"}},{"$f":"J28","v":"Çimento"},{"$f":"K28","v":{"$error":"#REF!"}}]
[null,{"$f":"'Reçete Dizayn-renkli'!N55","v":"SU"},{"$f":"'Reçete Dizayn-renkli'!O55","v":0},{"$f":"'Reçete Dizayn-renkli'!P55","v":"K.KUM"},{"$f":"'Reçete Dizayn-renkli'!Q55","v":0},{"$f":"'Reçete Dizayn-renkli'!R55","v":0},{"$f":"'Reçete Dizayn-renkli'!S55","v":0},null,null,"Su",{"$f":"C32*#REF!/1000","v":{"$error":"#REF!"}},{"$f":"J31","v":"Agrega"},{"$f":"K31","v":{"$error":"#REF!"}}]

{"sheet":"Otomatik Gradasyon","index":11,"n_rows":23,"n_cols":19,"rows_kept":23,"cut":false,"hidden":false,"merged":[[6,9,6,11],[6,0,6,7],[18,9,19,11],[20,9,20,11]]}
[]
[]
[]
[]
[null,null,null,null,null,null,null,null,null,null,null,null,null,6.3E-2,1,5,3,{"$f":"H22","v":1.4},{"$f":"'Reçete Dizayn-renkli'!H22","v":1.4}]
[null,null,null,null,null,null,null,null,null,null,null,null,null,0.125,2.5,8.5,5.5,{"$f":"H21","v":5.9950000000000001},{"$f":"'Reçete Dizayn-renkli'!H21","v":5.9950000000000001}]
["ELEKTEN GEÇEN MALZEME (%)",null,null,null,null,null,null,null,null,"KISITLAMALAR",null,null,null,0.25,6,15,10.5,{"$f":"H20","v":9.0566666666666666},{"$f":"'Reçete Dizayn-renkli'!H20","v":9.0566666666666666}]
["ELEK",{"$f":"'Reçete Dizayn-renkli'!B8","v":"1 NO"},{"$f":"'Reçete Dizayn-renkli'!C8","v":"2 NO"},{"$f":"'Reçete Dizayn-renkli'!D8","v":"T.TOZU"},{"$f":"'Reçete Dizayn-renkli'!E8","v":"D.KUM"},{"$f":"'Reçete Dizayn-renkli'!F8","v":"K.KUM"},{"$f":"'Reçete Dizayn-renkli'!G8","v":"G.D.AGR."},{"$f":"'Reçete Dizayn-renkli'!H7","v":"KARIŞIM"},null,null,"En az(%)","En çok(%)",null,0.5,10,22,16,{"$f":"H19","v":13.856666666666667},{"$f":"'Reçete Dizayn-renkli'!H19","v":13.856666666666667}]
[{"$f":"'Reçete Dizayn-renkli'!A9","v":31.5},{"$f":"'Reçete Dizayn-renkli'!B9","v":100},{"$f":"'Reçete Dizayn-renkli'!C9","v":100},{"$f":"'Reçete Dizayn-renkli'!D9","v":100},{"$f":"'Reçete Dizayn-renkli'!E9","v":100},{"$f":"'Reçete Dizayn-renkli'!F9","v":0},{"$f":"'Reçete Dizayn-renkli'!G9","v":0},{"$f":"($B$23*B9+$C$23*C9+$D$23*D9+$E$23*E9+$F$23*F9+$G$23*G9)/100","v":100},null,{"$f":"B8","v":"1 NO"},15,25,null,1,16,32,24,{"$f":"H18","v":20.40666666666667},{"$f":"'Reçete Dizayn-renkli'!H18","v":20.40666666666667}]
[{"$f":"'Reçete Dizayn-renkli'!A10","v":22.4},{"$f":"'Reçete Dizayn-renkli'!B10","v":100},{"$f":"'Reçete Dizayn-renkli'!C10","v":82.166666666666657},{"$f":"'Reçete Dizayn-renkli'!D10","v":100},{"$f":"'Reçete Dizayn-renkli'!E10","v":100},{"$f":"'Reçete Dizayn-renkli'!F10","v":0},{"$f":"'Reçete Dizayn-renkli'!G10","v":0},{"$f":"($B$23*B10+$C$23*C10+$D$23*D10+$E$23*E10+$F$23*F10+$G$23*G10)/100","v":96.433333333333323},null,{"$f":"C8","v":"2 NO"},35,45,null,2,25,43,34,{"$f":"H17","v":29.381666666666671},{"$f":"'Reçete Dizayn-renkli'!H17","v":29.381666666666671}]
[{"$f":"'Reçete Dizayn-renkli'!A11","v":19},{"$f":"'Reçete Dizayn-renkli'!B11","v":100},{"$f":"'Reçete Dizayn-renkli'!C11","v":48.966666666666669},{"$f":"'Reçete Dizayn-renkli'!D11","v":100},{"$f":"'Reçete Dizayn-renkli'!E11","v":100},{"$f":"'Reçete Dizayn-renkli'!F11","v":0},{"$f":"'Reçete Dizayn-renkli'!G11","v":0},{"$f":"($B$23*B11+$C$23*C11+$D$23*D11+$E$23*E11+$F$23*F11+$G$23*G11)/100","v":89.793333333333337},null,{"$f":"D8","v":"T.TOZU"},35,45,null,4,37,56,46.5,{"$f":"H16","v":46.575000000000003},{"$f":"'Reçete Dizayn-renkli'!H16","v":46.575000000000003}]
[{"$f":"'Reçete Dizayn-renkli'!A12","v":16},{"$f":"'Reçete Dizayn-renkli'!B12","v":98},{"$f":"'Reçete Dizayn-renkli'!C12","v":21.666666666666671},{"$f":"'Reçete Dizayn-renkli'!D12","v":100},{"$f":"'Reçete Dizayn-renkli'!E12","v":100},{"$f":"'Reçete Dizayn-renkli'!F12","v":0},{"$f":"'Reçete Dizayn-renkli'!G12","v":0},83.833333333333343,null,{"$f":"E8","v":"D.KUM"},15,25,null,5.6,46,64,55,{"$f":"H15","v":54.483333333333341},{"$f":"'Reçete Dizayn-renkli'!H15","v":54.483333333333341}]
[{"$f":"'Reçete Dizayn-renkli'!A13","v":11.2},{"$f":"'Reçete Dizayn-renkli'!B13","v":54.633333333333333},{"$f":"'Reçete Dizayn-renkli'!C13","v":0.96666666666666856},{"$f":"'Reçete Dizayn-renkli'!D13","v":100},{"$f":"'Reçete Dizayn-renkli'!E13","v":100},{"$f":"'Reçete Dizayn-renkli'!F13","v":0},{"$f":"'Reçete Dizayn-renkli'!G13","v":0},68.851666666666659,null,{"$f":"F8","v":"K.KUM"},0,0,null,8,54,71,62.5,{"$f":"H14","v":57.816666666666663},{"$f":"'Reçete Dizayn-renkli'!H14","v":57.816666666666663}]
[{"$f":"'Reçete Dizayn-renkli'!A14","v":8},{"$f":"'Reçete Dizayn-renkli'!B14","v":11},{"$f":"'Reçete Dizayn-renkli'!C14","v":0.3333333333333286},{"$f":"'Reçete Dizayn-renkli'!D14","v":100},{"$f":"'Reçete Dizayn-renkli'!E14","v":100},{"$f":"'Reçete Dizayn-renkli'!F14","v":0},{"$f":"'Reçete Dizayn-renkli'!G14","v":0},57.816666666666663,null,{"$f":"G8","v":"G.D.AGR."},null,null,null,11.2,63.5,79,71.25,{"$f":"H13","v":68.851666666666659},{"$f":"'Reçete Dizayn-renkli'!H13","v":68.851666666666659}]
[{"$f":"'Reçete Dizayn-renkli'!A15","v":5.6},{"$f":"'Reçete Dizayn-renkli'!B15","v":2.0666666666666771},{"$f":"'Reçete Dizayn-renkli'!C15","v":0.3333333333333286},{"$f":"'Reçete Dizayn-renkli'!D15","v":95.6},{"$f":"'Reçete Dizayn-renkli'!E15","v":100},{"$f":"'Reçete Dizayn-renkli'!F15","v":0},{"$f":"'Reçete Dizayn-renkli'!G15","v":0},54.483333333333341,null,null,null,null,null,16,73,86,79.5,{"$f":"H12","v":83.833333333333343},{"$f":"'Reçete Dizayn-renkli'!H12","v":83.833333333333343}]
[{"$f":"'Reçete Dizayn-renkli'!A16","v":4},{"$f":"'Reçete Dizayn-renkli'!B16","v":0.3333333333333286},{"$f":"'Reçete Dizayn-renkli'!C16","v":0.3333333333333286},{"$f":"'Reçete Dizayn-renkli'!D16","v":77.7},{"$f":"'Reçete Dizayn-renkli'!E16","v":90},{"$f":"'Reçete Dizayn-renkli'!F16","v":0},{"$f":"'Reçete Dizayn-renkli'!G16","v":0},46.575000000000003,null,"İRİ AGR.",45,50,null,19,80.5,91,85.75,{"$f":"H11","v":89.793333333333337},{"$f":"'Reçete Dizayn-renkli'!H11","v":89.793333333333337}]
[{"$f":"'Reçete Dizayn-renkli'!A17","v":2},{"$f":"'Reçete Dizayn-renkli'!B17","v":0.26666666666666572},{"$f":"'Reçete Dizayn-renkli'!C17","v":0.20000000000000284},{"$f":"'Reçete Dizayn-renkli'!D17","v":55.9},{"$f":"'Reçete Dizayn-renkli'!E17","v":51},{"$f":"'Reçete Dizayn-renkli'!F17","v":0},{"$f":"'Reçete Dizayn-renkli'!G17","v":0},29.381666666666671,null,"İNCE AGR.",50,55,null,22.4,89,96,92.5,{"$f":"H10","v":96.433333333333323},{"$f":"'Reçete Dizayn-renkli'!H10","v":96.433333333333323}]
[{"$f":"'Reçete Dizayn-renkli'!A18","v":1},{"$f":"'Reçete Dizayn-renkli'!B18","v":0.26666666666666572},{"$f":"'Reçete Dizayn-renkli'!C18","v":0.20000000000000284},{"$f":"'Reçete Dizayn-renkli'!D18","v":39.200000000000003},{"$f":"'Reçete Dizayn-renkli'!E18","v":35},{"$f":"'Reçete Dizayn-renkli'!F18","v":0},{"$f":"'Reçete Dizayn-renkli'!G18","v":0},{"$f":"($B$23*B18+$C$23*C18+$D$23*D18+$E$23*E18+$F$23*F18+$G$23*G18)/100","v":20.40666666666667},null,null,null,null,null,31.5,100,100,100,{"$f":"H9","v":100},{"$f":"'Reçete Dizayn-renkli'!H9","v":100}]
[{"$f":"'Reçete Dizayn-renkli'!A19","v":0.5},{"$f":"'Reçete Dizayn-renkli'!B19","v":0.26666666666666572},{"$f":"'Reçete Dizayn-renkli'!C19","v":0.20000000000000284},{"$f":"'Reçete Dizayn-renkli'!D19","v":23.8},{"$f":"'Reçete Dizayn-renkli'!E19","v":26},{"$f":"'Reçete Dizayn-renkli'!F19","v":0},{"$f":"'Reçete Dizayn-renkli'!G19","v":0},{"$f":"($B$23*B19+$C$23*C19+$D$23*D19+$E$23*E19+$F$23*F19+$G$23*G19)/100","v":13.856666666666667},null,"ÇOK İNCE MALZEME MUHTEVASI                                              (EN 12620) ( <0,063mm)"]
[{"$f":"'Reçete Dizayn-renkli'!A20","v":0.25},{"$f":"'Reçete Dizayn-renkli'!B20","v":0.26666666666666572},{"$f":"'Reçete Dizayn-renkli'!C20","v":0.20000000000000284},{"$f":"'Reçete Dizayn-renkli'!D20","v":11.8},{"$f":"'Reçete Dizayn-renkli'!E20","v":20},{"$f":"'Reçete Dizayn-renkli'!F20","v":0},{"$f":"'Reçete Dizayn-renkli'!G20","v":0},9.0566666666666666]
[{"$f":"'Reçete Dizayn-renkli'!A21","v":0.125},{"$f":"'Reçete Dizayn-renkli'!B21","v":0.1},{"$f":"'Reçete Dizayn-renkli'!C21","v":0.1},{"$f":"'Reçete Dizayn-renkli'!D21","v":7},{"$f":"'Reçete Dizayn-renkli'!E21","v":14},{"$f":"'Reçete Dizayn-renkli'!F21","v":0},{"$f":"'Reçete Dizayn-renkli'!G21","v":0},5.9950000000000001,null,{"$f":"IF(ISERROR((D22*D23+E22*E23+F22*F23+G22*G23)/(D23+E23+F23+G23)),\"\",(D22*D23+E22*E23+F22*F23+G22*G23)/(D23+E23+F23+G23))","v":2.5454545454545454}]
[{"$f":"'Reçete Dizayn-renkli'!A22","v":6.3E-2},{"$f":"'Reçete Dizayn-renkli'!B22","v":0},{"$f":"'Reçete Dizayn-renkli'!C22","v":0},{"$f":"'Reçete Dizayn-renkli'!D22","v":2},{"$f":"'Reçete Dizayn-renkli'!E22","v":3},{"$f":"'Reçete Dizayn-renkli'!F22","v":0},{"$f":"'Reçete Dizayn-renkli'!G22","v":0},1.4,null,null,"En az(%)","En çok(%)"]
[{"$f":"'Reçete Dizayn-renkli'!A23","v":"MİKTAR(%)"},25,20,25,30,0,0,{"$f":"SUM(B23:G23)","v":100},null,"0,25 mm",18,22]