{"text_format":"1","workbook":"xlsx","n_sheets":12,"sheets":["Açıklama","Reçete Dizayn-renkli","Sheet2","Sheet3","Sheet4","Sheet5","Sheet6","Sheet7","Sheet8","Siyah-Beyaz","Diğer","Otomatik Gradasyon"],"not_rendered":{"charts":17,"images":4,"macros":1,"external_links":0,"defined_names":124,"comments":1,"pivot_tables":0},"unopened":[],"bounds":{"document_bytes":16777216,"sheet_cells":100000,"rows_first":2000,"rows_last":500,"rows_between":2000,"halvings":0,"cell_chars":16384,"cell_head_chars":4096},"cells_cut":0,"cells_raw":0,"read":"whole","date_system":"1900"}

{"sheet":"Açıklama","index":0,"n_rows":16,"n_cols":21,"rows_kept":16,"cut":false,"hidden":false,"merged":[[2,1,2,9],[4,1,4,9],[6,1,6,9],[15,14,15,18],[11,20,11,21],[11,11,11,15],[2,11,5,21],[7,11,7,21],[9,11,9,21]]}
[]
[]
[null,"SADECE SARI KUTULARA VERİ GİRİNİZ",null,null,null,null,null,null,null,null,null,"HAZIRLAYAN: YASİN ENGİN (İnş.Yük.Müh)               "]
[]
[null,"VERİLERİ SADECE \"REÇETE DİZAYN-renkli\" SAYFASINA GİRİNİZ"]
[]
[null,"\"SİYAH-BEYAZ\" VE \"DİĞER\" İSİMLİ SAYFALAR ÇIKTI İÇİN KULLANILABİLİR."]
[null,null,null,null,null,null,null,null,null,null,null,"www.betonvecimento.com "]
[]
[null,null,null,null,null,null,null,null,null,null,null,"yasin.engin@gmail.com"]
{"$rows_left_out":7}
{"sheet":"Reçete Dizayn-renkli","index":1,"n_rows":55,"n_cols":25,"rows_kept":55,"cut":false,"hidden":false,"merged":[[0,0,0,8],[21,9,22,11],[21,12,22,12],[22,6,23,6],[6,1,6,6],[6,7,7,7],[22,7,23,7],[22,5,23,5],[2,3,2,4],[22,0,23,0],[22,1,23,1],[22,2,23,2],[22,3,23,3],[22,4,23,4],[3,3,3,4],[2,6,2,7],[2,9,2,10],[3,9,3,10],[2,11,2,12],[3,11,3,12],[23,9,25,9],[23,10,25,10],[23,11,25,11],[23,12,25,12],[5,9,5,12],[5,0,5,7],[35,23,35,24],[36,23,36,24],[37,23,37,24],[38,23,38,24],[36,21,36,22],[0,9,0,10],[0,11,0,12],[27,9,27,10],[27,11,27,12],[30,12,31,12],[30,9,31,9],[29,9,29,11],[30,10,31,10],[30,11,31,11],[33,13,33,20],[29,23,30,24],[34,23,34,24],[26,23,26,24],[29,21,30,21],[29,22,30,22],[33,21,33,22],[34,21,34,22],[37,21,37,22],[35,21,35,22],[39,23,39,24],[40,23,40,24],[41,23,41,24],[42,23,42,24],[24,19,27,20],[28,19,30,20],[24,21,25,24],[27,21,28,21],[27,22,28,22],[32,21,32,24],[33,23,33,24],[38,21,38,22],[27,23,28,24],[44,23,44,24],[45,23,45,24],[53,17,54,17],[53,18,54,18],[43,21,43,22],[44,21,44,22],[45,21,45,22],[48,17,49,17],[48,18,49,18],[47,13,47,24],[46,23,46,24],[48,14,49,14],[43,23,43,24],[53,7,54,7],[51,7,52,7],[46,21,46,22],[53,11,54,11],[51,12,52,12],[53,12,54,12],[49,9,49,10],[49,11,49,12],[51,11,52,11],[50,11,50,12],[47,11,48,11],[47,12,48,12],[51,0,51,6],[39,21,39,22],[40,21,40,22],[41,21,41,22],[42,21,42,22],[40,0,40,6],[50,0,50,1],[50,4,50,5],[39,1,39,7],[48,13,49,13],[48,16,49,16],[48,15,49,15],[47,9,48,9],[47,10,48,10]]}
["BETON REÇETE DİZAYN PROGRAMI",null,null,null,null,null,null,null,null,"Rapor No/Tarih"]
[]
["Beton Sınıfı","C30/37",{"$f":"IF(B3<Sheet4!I4,\"DEĞİŞTİR\",\"\")","v":""},"Çev. Etki Sınıfı",null,"XC2",{"$f":"IF(B3<Sheet4!I4,Sheet4!I9,\"\")","v":""},null,null,"Klorür Sınıfı",null,{"$f":"IF(ISERROR(IF(Sheet2!F21=0,\"\",Sheet2!D27)),\"\",IF(Sheet2!F21=0,\"\",Sheet2!D27))","v":""},null,null,100,100,100,100,100,100,{"$f":"H23","v":100}]
["Çimento Sınıfı","CEM I",null,"Min.Katkı k değeri",null,0.4,null,null,null,"Alkali Miktarı(kg/m3)",null,{"$f":"IF(ISERROR(IF(Sheet3!F26=0,\"\",Sheet3!F26)),\"\",IF(Sheet3!F26=0,\"\",Sheet3!F26))","v":""},null,null,{"$f":"B23","v":25},{"$f":"C23","v":20},25,{"$f":"E23","v":30},{"$f":"F23","v":0},{"$f":"G23","v":0}]
[]
["AGREGA GRADASYON HESAPLAMASI",null,null,null,null,null,null,null,null,"BİLEŞEN ÖZELLİKLERİ"]
["ELEK EBATI","ELEKTEN GEÇEN MALZEME (%)",null,null,null,null,null,"KARIŞIM",null,"Bileşen","Öz.Ağırlık","Cl(%)","Alkali(%)"]
["( mm )","1 NO","2 NO","T.TOZU","D.KUM","K.KUM","G.D.AGR.",null,null,"1 NO",2.7]
[31.5,100,100,100,100,null,null,{"$f":"($B$23*B9+$C$23*C9+$D$23*D9+$E$23*E9+$F$23*F9+$G$23*G9)/100","v":100},null,"2 NO",2.7]
[22.4,100,82.166666666666657,100,100,null,null,96.433333333333323,null,"T.TOZU",2.69]
{"$rows_left_out":46}
{"sheet":"Sheet2","index":2,"n_rows":27,"n_cols":8,"rows_kept":27,"cut":false,"hidden":true,"merged":[[26,3,26,4],[1,2,1,5],[3,3,3,4],[4,4,4,5],[4,7,4,10],[19,2,19,5],[20,2,20,4]]}
[]
[null,null,"Klorür İçeriği Hesabı"]
[]
[null,null,null,"VERİLERİ GİRİNİZ"]
[null,null,"Bileşenler","Ağırlık, kg","           Klorür İçeriği",null,null,"TS EN 206-1'e göre Klorür İçeriği Sınıfları"]
[null,null,{"$f":"'Reçete Dizayn-renkli'!J8","v":"1 NO"},{"$f":"'Reçete Dizayn-renkli'!K33","v":462.55489442815258},{"$f":"'Reçete Dizayn-renkli'!L8","v":0},"%",{"$f":"D6*E6/100","v":0}]
[null,null,{"$f":"'Reçete Dizayn-renkli'!J9","v":"2 NO"},{"$f":"'Reçete Dizayn-renkli'!K34","v":370.04391554252197},{"$f":"'Reçete Dizayn-renkli'!L9","v":0},"%",{"$f":"D7*E7/100","v":0}]
[null,null,{"$f":"'Reçete Dizayn-renkli'!J10","v":"T.TOZU"},{"$f":"'Reçete Dizayn-renkli'!K35","v":456.23331087096784},{"$f":"'Reçete Dizayn-renkli'!L10","v":0},"%",0]
[null,null,{"$f":"'Reçete Dizayn-renkli'!J11","v":"D.KUM"},{"$f":"'Reçete Dizayn-renkli'!K36","v":533.23328229677429},{"$f":"'Reçete Dizayn-renkli'!L11","v":0},"%",0]
[null,null,{"$f":"'Reçete Dizayn-renkli'!J12","v":"K.KUM"},{"$f":"'Reçete Dizayn-renkli'!K37","v":0},{"$f":"'Reçete Dizayn-renkli'!L12","v":0},"%",0]
{"$rows_left_out":18}
{"sheet":"Sheet3","index":3,"n_rows":40,"n_cols":7,"rows_kept":40,"cut":false,"hidden":true,"merged":[[6,2,6,5],[39,6,40,6],[8,3,8,4],[9,4,9,5],[24,6,24,7],[24,2,24,5],[25,2,25,4],[25,6,25,7]]}
[]
[]
[]
[]
[]
[]
[null,null,"Toplam Alkali İçeriği Hesabı"]
[]
[null,null,null,"VERİLERİ GİRİNİZ"]
[null,null,"Bileşenler","Ağırlık, kg","            Alkali İçeriği"]
{"$rows_left_out":31}
{"sheet":"Sheet4","index":4,"n_rows":63,"n_cols":16,"rows_kept":63,"cut":false,"hidden":true,"merged":[]}
[]
["X0","-","C8/10","-","-"]
["XA1",0.6,"C25/30",280,270]
["XA2",0.5,"C35/45",320,270,null,"≤",{"$f":"LOOKUP('Reçete Dizayn-renkli'!F3,Sheet4!A2:B25)","v":0.65},{"$f":"LOOKUP('Reçete Dizayn-renkli'!F3,Sheet4!A2:C25)","v":"C25/30"},null,null,null,"CEM I",null,null,"C20/25"]
["XA3",0.45,"C35/45",320,270,null,"≥",null,null,null,null,null,"CEM II",null,null,"C25/30"]
["XC1",0.7,"C20/25",240,240,null,null,null,null,null,null,null,null,null,null,"C30/37"]
["XC2",0.65,"C25/30",260,240,null,null,null,null,null,null,null,null,null,null,"C35/45"]
["XC3",0.6,"C30/37",270,240,null,null,null,null,null,null,null,null,null,null,"C40/50"]
["XC4",0.55000000000000004,"C30/37",280,270,null,null,{"$f":"G4&\"\"&H4","v":"≤0,65"},{"$f":"G5&\"\"&I4","v":"≥C25/30"},null,null,null,null,null,null,"C45/55"]
["XD1",0.55000000000000004,"C30/37",300,270,null,null,null,null,null,null,null,null,null,null,"C50/60"]
{"$rows_left_out":54}
{"sheet":"Sheet5","index":5,"n_rows":27,"n_cols":24,"rows_kept":27,"cut":false,"hidden":true,"merged":[[22,4,23,7],[22,8,23,9],[22,14,23,14],[26,3,27,10],[15,4,15,9],[15,12,15,14],[17,4,18,7],[17,8,18,9],[17,10,18,10],[8,20,13,22],[8,23,13,25],[11,4,13,4],[11,5,13,7],[0,20,2,22],[0,23,2,25],[3,20,7,22],[3,23,7,25],[8,11,13,13],[8,14,13,16],[8,17,13,19],[0,17,2,19],[3,11,7,13],[3,14,7,16],[3,17,7,19],[0,0,21,0],[0,3,2,7],[0,8,2,10],[0,11,2,13],[0,14,2,16],[19,4,20,7],[19,8,20,9],[19,10,20,10],[21,8,21,9],[8,3,13,3],[8,4,10,4],[8,5,10,7],[8,8,13,10],[3,3,7,3],[3,4,7,7],[3,8,7,10]]}
["SEÇİNİZ",18,null,"Çevresel Etki Sınıfı",null,null,null,null,"En büyük su/çimento oranı",null,null,"En düşük beton sınıfı",null,null,"En az çimento (bağlayıcı) içeriği(kg/m3)",null,null,"Mineral katkı ile birlikte en az çimento içeriği(kg/m3)",null,null,"En az hava içeriği(%)",null,null,"Diğer özellikler"]
[]
[]
[null,null,null,"TS 13515","XA1",null,null,null,0.6,null,null,"C25/30",null,null,280,null,null,270,null,null,0,null,null,0]
[]
[]
[]
[]
[null,null,null,"TS EN 206-1","A","Betonun kimyasal etkilere maruz kalması",null,null,0.55000000000000004,null,null,"C30/37",null,null,300,null,null,"-",null,null,"-",null,null,"-"]
[]
{"$rows_left_out":18}
{"sheet":"Sheet6","index":6,"n_rows":29,"n_cols":21,"rows_kept":29,"cut":false,"hidden":true,"merged":[[0,1,0,6]]}
[null,"TS 13515"]
["X0","-","C8/10","-","-","-","-","-","C12/15","-","-","-","-"]
["XC1",0.7,"C20/25",240,240,"-","-",0.65,"C20/25",260,"-","-","-"]
["XC2",0.65,"C25/30",260,240,"-","-",0.6,"C25/30",280,"-","-","-"]
["XC3",0.6,"C30/37",270,240,"-","-",0.55000000000000004,"C30/37",280,"-","-","-",null,1,1,null,300,0,{"$f":"#VALUE!","v":{"$error":"#VALUE!"}},{"$f":"R5+T5","v":{"$error":"#VALUE!"}}]
["XC4",0.55000000000000004,"C30/37",280,270,"-","-",0.5,"C30/37",280,"-","-","-",null,"YOK","CEM I"]
["XD1",0.55000000000000004,"C30/37",300,270,"-","-",0.55000000000000004,"C30/37",300,"-","-","-",null,"Cüruf","CEM II"]
["XD2",0.5,"C35/45",320,270,"-","-",0.55000000000000004,"C30/37",300,"-","-","-",null,"Uçucu kül"]
["XD3",0.45,"C35/45",320,270,"-","-",0.45,"C35/45",320,"-","-","-",null,"Silis dumanı"]
["XS1",0.55000000000000004,"C30/37",300,270,"-","-",0.5,"C30/37",300,"-","-","-"]
{"$rows_left_out":20}
{"sheet":"Sheet7","index":7,"n_rows":52,"n_cols":13,"rows_kept":52,"cut":false,"hidden":true,"merged":[[48,0,48,7],[50,9,51,9],[50,10,51,10],[50,11,51,11],[50,12,51,12],[21,5,22,5],[47,6,47,7],[22,12,23,12],[27,9,27,10],[27,11,27,12],[28,9,28,10],[28,11,28,12],[31,9,31,10],[31,11,31,12],[21,6,22,6],[21,7,22,7],[33,9,33,11],[37,0,37,7],[47,0,47,1],[47,2,47,3],[47,4,47,5],[21,0,22,0],[21,1,22,1],[21,2,22,2],[21,3,22,3],[21,4,22,4],[21,9,21,11],[22,9,23,9],[22,10,23,10],[22,11,23,11],[0,0,0,12],[2,3,2,4],[2,6,2,7],[2,9,2,10],[2,11,2,12],[3,3,3,4],[3,9,3,10],[3,11,3,12],[5,0,5,7],[5,9,5,12],[6,1,6,6],[6,7,7,7]]}
["BETON REÇETE DİZAYN PROGRAMI"]
[]
["Beton Sınıfı",{"$f":"'Reçete Dizayn-renkli'!B3","v":"C30/37"},null,"Çev. Etki Sınıfı",null,{"$f":"'Reçete Dizayn-renkli'!F3","v":"XC2"},null,null,null,"Klorür Sınıfı",null,{"$f":"'Reçete Dizayn-renkli'!L3","v":""},{"$f":"'Reçete Dizayn-renkli'!M3","v":0}]
["Çimento Sınıfı",{"$f":"'Reçete Dizayn-renkli'!B4","v":"CEM I"},null,"Min.Katkı k değeri",null,{"$f":"'Reçete Dizayn-renkli'!F4","v":0.4},null,null,null,"Alkali Miktarı(kg/m3)",null,{"$f":"'Reçete Dizayn-renkli'!L4","v":""},{"$f":"'Reçete Dizayn-renkli'!M4","v":0}]
[]
["AGREGA GRADASYON HESAPLAMASI",null,null,null,null,null,null,null,null,"BİLEŞEN ÖZELLİKLERİ"]
["ELEK EBATI","ELEKTEN GEÇEN MALZEME (%)",null,null,null,null,null,"KARIŞIM",null,null,"Öz.Ağırlık","Cl(%)","Alkali(%)"]
["( mm )","1 NO","2 NO","T.TOZU","D.KUM","K.KUM","G.D.AGR.",null,null,"1 NO",{"$f":"'Reçete Dizayn-renkli'!K8","v":2.7},{"$f":"'Reçete Dizayn-renkli'!L8","v":0},{"$f":"'Reçete Dizayn-renkli'!M8","v":0}]
[31.5,{"$f":"'Reçete Dizayn-renkli'!B9","v":100},{"$f":"'Reçete Dizayn-renkli'!C9","v":100},{"$f":"'Reçete Dizayn-renkli'!D9","v":100},{"$f":"'Reçete Dizayn-renkli'!E9","v":100},{"$f":"'Reçete Dizayn-renkli'!F9","v":0},{"$f":"'Reçete Dizayn-renkli'!G9","v":0},{"$f":"($B$22*B9+$C$22*C9+$D$22*D9+$E$22*E9+$F$22*F9+$G$22*G9)/100","v":100},null,"2 NO",{"$f":"'Reçete Dizayn-renkli'!K9","v":2.7},{"$f":"'Reçete Dizayn-renkli'!L9","v":0},{"$f":"'Reçete Dizayn-renkli'!M9","v":0}]
[22.4,{"$f":"'Reçete Dizayn-renkli'!B10","v":100},{"$f":"'Reçete Dizayn-renkli'!C10","v":82.166666666666657},{"$f":"'Reçete Dizayn-renkli'!D10","v":100},{"$f":"'Reçete Dizayn-renkli'!E10","v":100},{"$f":"'Reçete Dizayn-renkli'!F10","v":0},{"$f":"'Reçete Dizayn-renkli'!G10","v":0},{"$f":"($B$22*B10+$C$22*C10+$D$22*D10+$E$22*E10+$F$22*F10+$G$22*G10)/100","v":96.433333333333323},null,"T.TOZU",{"$f":"'Reçete Dizayn-renkli'!K10","v":2.69},{"$f":"'Reçete Dizayn-renkli'!L10","v":0},{"$f":"'Reçete Dizayn-renkli'!M10","v":0}]
{"$rows_left_out":43}
{"sheet":"Sheet8","index":8,"n_rows":16,"n_cols":9,"rows_kept":16,"cut":false,"hidden":true,"merged":[]}
[]
[]
[0.125,6.3E-2,1,5,{"$f":"AVERAGE(C3:D3)","v":3},null,1,5,{"$f":"AVERAGE(G3:H3)","v":3}]
[0.25,0.125,2.5,8.5,5.5,null,2.5,8.5,{"$f":"AVERAGE(G4:H4)","v":5.5}]
[0.5,0.25,6,15,10.5,null,6,16,{"$f":"AVERAGE(G5:H5)","v":11}]
[1,0.5,10,22,16,null,10,23,16.5]
[2,1,16,32,24,null,17,33,25]
[4,2,25,43,34,null,26,43,34.5]
[5.6,4,37,56,46.5,null,37,56,46.5]
[8,5.6,46,64,55,null,45,63,54]
{"$rows_left_out":7}
{"sheet":"Siyah-Beyaz","index":9,"n_rows":56,"n_cols":14,"rows_kept":56,"cut":false,"hidden":false,"merged":[[50,10,50,11],[50,12,50,13],[51,12,51,13],[52,12,53,12],[52,13,53,13],[51,10,51,11],[52,8,53,8],[54,8,55,8],[54,12,55,12],[54,13,55,13],[51,1,51,2],[51,5,51,6],[52,1,52,7],[23,7,24,7],[23,8,24,8],[22,10,23,12],[31,13,32,13],[48,10,49,10],[48,11,49,11],[48,12,49,12],[48,13,49,13],[41,1,41,7],[31,10,32,10],[40,2,40,8],[23,2,24,2],[23,3,24,3],[23,4,24,4],[23,5,24,5],[23,6,24,6],[30,10,30,12],[31,11,32,11],[31,12,32,12],[24,13,26,13],[28,10,28,11],[28,12,28,13],[24,10,26,10],[24,11,26,11],[24,12,26,12],[22,13,23,13],[7,2,7,7],[7,8,8,8],[1,1,1,9],[1,10,1,11],[1,12,1,13],[3,4,3,5],[3,7,3,8],[3,10,3,11],[3,12,3,13],[4,4,4,5],[4,10,4,11],[4,12,4,13],[6,1,6,8],[6,10,6,13],[23,1,24,1]]}
[]
[null,"BETON REÇETE DİZAYN PROGRAMI",null,null,null,null,null,null,null,null,"Rapor No/Tarih",null,{"$f":"IF('Reçete Dizayn-renkli'!L1=\"\",\"\",'Reçete Dizayn-renkli'!L1)","v":""},{"$f":"'Reçete Dizayn-renkli'!M1","v":0}]
[]
[null,"Beton Sınıfı",{"$f":"IF('Reçete Dizayn-renkli'!B3=\"\",\"\",'Reçete Dizayn-renkli'!B3)","v":"C30/37"},{"$f":"IF(C4<Sheet4!I4,\"DEĞİŞTİR\",\"\")","v":""},"Çev. Etki Sınıfı",null,{"$f":"IF('Reçete Dizayn-renkli'!F3=\"\",\"\",'Reçete Dizayn-renkli'!F3)","v":"XC2"},{"$f":"IF(C4<Sheet4!I4,Sheet4!I9,\"\")","v":""},null,null,"Klorür Sınıfı",null,{"$f":"'Reçete Dizayn-renkli'!L3","v":""},{"$f":"'Reçete Dizayn-renkli'!M3","v":0}]
[null,"Çimento Sınıfı",{"$f":"IF('Reçete Dizayn-renkli'!B4=\"\",\"\",'Reçete Dizayn-renkli'!B4)","v":"CEM I"},null,"Min.Katkı k değeri",null,{"$f":"IF('Reçete Dizayn-renkli'!F4=\"\",\"\",'Reçete Dizayn-renkli'!F4)","v":0.4},null,null,null,"Alkali Miktarı(kg/m3)",null,{"$f":"'Reçete Dizayn-renkli'!L4","v":""},{"$f":"'Reçete Dizayn-renkli'!M4","v":0}]
[]
[null,"AGREGA GRADASYON HESAPLAMASI",null,null,null,null,null,null,null,null,"BİLEŞEN ÖZELLİKLERİ"]
[null,"ELEK EBATI","ELEKTEN GEÇEN MALZEME (%)",null,null,null,null,null,"KARIŞIM",null,"Bileşen","Öz.Ağırlık","Cl(%)","Alkali(%)"]
[null,"( mm )","1 NO","2 NO","T.TOZU","D.KUM","K.KUM","G.D.AGR.",null,null,"1 NO",{"$f":"IF('Reçete Dizayn-renkli'!K8=\"\",\"\",'Reçete Dizayn-renkli'!K8)","v":2.7},{"$f":"IF('Reçete Dizayn-renkli'!L8=\"\",\"\",'Reçete Dizayn-renkli'!L8)","v":""},{"$f":"IF('Reçete Dizayn-renkli'!M8=\"\",\"\",'Reçete Dizayn-renkli'!M8)","v":""}]
[null,31.5,{"$f":"IF('Reçete Dizayn-renkli'!B9=\"\",\"\",'Reçete Dizayn-renkli'!B9)","v":100},{"$f":"IF('Reçete Dizayn-renkli'!C9=\"\",\"\",'Reçete Dizayn-renkli'!C9)","v":100},{"$f":"IF('Reçete Dizayn-renkli'!D9=\"\",\"\",'Reçete Dizayn-renkli'!D9)","v":100},{"$f":"IF('Reçete Dizayn-renkli'!E9=\"\",\"\",'Reçete Dizayn-renkli'!E9)","v":100},{"$f":"IF('Reçete Dizayn-renkli'!F9=\"\",\"\",'Reçete Dizayn-renkli'!F9)","v":""},{"$f":"IF('Reçete Dizayn-renkli'!G9=\"\",\"\",'Reçete Dizayn-renkli'!G9)","v":""},{"$f":"IF('Reçete Dizayn-renkli'!H9=\"\",\"\",'Reçete Dizayn-renkli'!H9)","v":100},null,"2 NO",{"$f":"IF('Reçete Dizayn-renkli'!K9=\"\",\"\",'Reçete Dizayn-renkli'!K9)","v":2.7},{"$f":"IF('Reçete Dizayn-renkli'!L9=\"\",\"\",'Reçete Dizayn-renkli'!L9)","v":""},{"$f":"IF('Reçete Dizayn-renkli'!M9=\"\",\"\",'Reçete Dizayn-renkli'!M9)","v":""}]
{"$rows_left_out":47}
{"sheet":"Diğer","index":10,"n_rows":32,"n_cols":13,"rows_kept":32,"cut":false,"hidden":false,"merged":[[1,7,4,8],[5,7,7,8],[30,5,31,5],[30,6,31,6],[24,1,24,12],[25,1,26,1],[25,2,26,2],[25,3,26,3],[25,4,26,4],[25,5,26,5],[25,6,26,6],[21,9,21,10],[21,11,21,12],[22,9,22,10],[22,11,22,12],[23,9,23,10],[23,11,23,12],[18,9,18,10],[18,11,18,12],[19,9,19,10],[19,11,19,12],[20,9,20,10],[20,11,20,12],[15,9,15,10],[15,11,15,12],[16,9,16,10],[16,11,16,12],[17,9,17,10],[17,11,17,12],[12,9,12,10],[12,11,12,12],[13,9,13,10],[13,11,13,12],[14,9,14,10],[14,11,14,12],[9,9,9,12],[10,1,10,8],[10,9,10,10],[10,11,10,12],[11,9,11,10],[11,11,11,12],[6,9,7,9],[6,10,7,10],[6,11,7,12],[1,9,2,12],[3,11,3,12],[4,9,5,9],[4,10,5,10],[4,11,5,12]]}
[]
[null,null,null,null,null,null,null,"ÇOK İNCE MALZEME MUHTEVASI                    (TS 13515)                         (<0,125mm) (kg)",null,{"$f":"'Reçete Dizayn-renkli'!V25","v":"ÇOK İNCE MALZEME MUHTEVASI                    (EN 12620) ( <0,063mm)"}]
[]
[null,null,null,null,null,null,null,null,null,"Tip","Değer(%)","Sınıf"]
[null,null,null,null,null,null,null,null,null,"İnce Agrega",{"$f":"'Reçete Dizayn-renkli'!W28","v":2.5454545454545454},{"$f":"'Reçete Dizayn-renkli'!X28","v":"f3"},{"$f":"'Reçete Dizayn-renkli'!Y28","v":0}]
[null,null,null,null,null,null,null,{"$f":"'Reçete Dizayn-renkli'!T29","v":449.23282091814804},null,null,{"$f":"'Reçete Dizayn-renkli'!W29","v":0},{"$f":"'Reçete Dizayn-renkli'!X29","v":0},{"$f":"'Reçete Dizayn-renkli'!Y29","v":0}]
[null,null,null,null,null,null,null,null,null,"İri     Agrega",{"$f":"'Reçete Dizayn-renkli'!W30","v":0},{"$f":"'Reçete Dizayn-renkli'!X30","v":"f3"},{"$f":"'Reçete Dizayn-renkli'!Y30","v":0}]
[null,null,null,null,null,null,null,null,null,null,{"$f":"'Reçete Dizayn-renkli'!W31","v":0},{"$f":"'Reçete Dizayn-renkli'!X31","v":0},{"$f":"'Reçete Dizayn-renkli'!Y31","v":0}]
[]
[null,null,null,null,null,null,null,null,null,"Elek Arası Kalan (%)"]
{"$rows_left_out":23}
{"sheet":"Otomatik Gradasyon","index":11,"n_rows":23,"n_cols":19,"rows_kept":23,"cut":false,"hidden":false,"merged":[[6,9,6,11],[6,0,6,7],[18,9,19,11],[20,9,20,11]]}
[]
[]
[]
[]
[null,null,null,null,null,null,null,null,null,null,null,null,null,6.3E-2,1,5,3,{"$f":"H22","v":1.4},{"$f":"'Reçete Dizayn-renkli'!H22","v":1.4}]
[null,null,null,null,null,null,null,null,null,null,null,null,null,0.125,2.5,8.5,5.5,{"$f":"H21","v":5.9950000000000001},{"$f":"'Reçete Dizayn-renkli'!H21","v":5.9950000000000001}]
["ELEKTEN GEÇEN MALZEME (%)",null,null,null,null,null,null,null,null,"KISITLAMALAR",null,null,null,0.25,6,15,10.5,{"$f":"H20","v":9.0566666666666666},{"$f":"'Reçete Dizayn-renkli'!H20","v":9.0566666666666666}]
["ELEK",{"$f":"'Reçete Dizayn-renkli'!B8","v":"1 NO"},{"$f":"'Reçete Dizayn-renkli'!C8","v":"2 NO"},{"$f":"'Reçete Dizayn-renkli'!D8","v":"T.TOZU"},{"$f":"'Reçete Dizayn-renkli'!E8","v":"D.KUM"},{"$f":"'Reçete Dizayn-renkli'!F8","v":"K.KUM"},{"$f":"'Reçete Dizayn-renkli'!G8","v":"G.D.AGR."},{"$f":"'Reçete Dizayn-renkli'!H7","v":"KARIŞIM"},null,null,"En az(%)","En çok(%)",null,0.5,10,22,16,{"$f":"H19","v":13.856666666666667},{"$f":"'Reçete Dizayn-renkli'!H19","v":13.856666666666667}]
[{"$f":"'Reçete Dizayn-renkli'!A9","v":31.5},{"$f":"'Reçete Dizayn-renkli'!B9","v":100},{"$f":"'Reçete Dizayn-renkli'!C9","v":100},{"$f":"'Reçete Dizayn-renkli'!D9","v":100},{"$f":"'Reçete Dizayn-renkli'!E9","v":100},{"$f":"'Reçete Dizayn-renkli'!F9","v":0},{"$f":"'Reçete Dizayn-renkli'!G9","v":0},{"$f":"($B$23*B9+$C$23*C9+$D$23*D9+$E$23*E9+$F$23*F9+$G$23*G9)/100","v":100},null,{"$f":"B8","v":"1 NO"},15,25,null,1,16,32,24,{"$f":"H18","v":20.40666666666667},{"$f":"'Reçete Dizayn-renkli'!H18","v":20.40666666666667}]
[{"$f":"'Reçete Dizayn-renkli'!A10","v":22.4},{"$f":"'Reçete Dizayn-renkli'!B10","v":100},{"$f":"'Reçete Dizayn-renkli'!C10","v":82.166666666666657},{"$f":"'Reçete Dizayn-renkli'!D10","v":100},{"$f":"'Reçete Dizayn-renkli'!E10","v":100},{"$f":"'Reçete Dizayn-renkli'!F10","v":0},{"$f":"'Reçete Dizayn-renkli'!G10","v":0},{"$f":"($B$23*B10+$C$23*C10+$D$23*D10+$E$23*E10+$F$23*F10+$G$23*G10)/100","v":96.433333333333323},null,{"$f":"C8","v":"2 NO"},35,45,null,2,25,43,34,{"$f":"H17","v":29.381666666666671},{"$f":"'Reçete Dizayn-renkli'!H17","v":29.381666666666671}]
{"$rows_left_out":13}